Uploaded image for project: 'Flink'
  1. Flink
  2. FLINK-23682

HAQueryableStateFsBackendITCase.testCustomKryoSerializerHandling fails due to AskTimeoutException

Attach filesAttach ScreenshotVotersWatch issueWatchersCreate sub-taskLinkCloneUpdate Comment AuthorReplace String in CommentUpdate Comment VisibilityDelete Comments
    XMLWordPrintableJSON

Details

    Description

      https://dev.azure.com/apache-flink/apache-flink/_build/results?buildId=21739&view=logs&j=961f8f81-6b52-53df-09f6-7291a2e4af6a&t=60581941-0138-53c0-39fe-86d62be5f407&l=14674

      [ERROR] Tests run: 12, Failures: 0, Errors: 1, Skipped: 1, Time elapsed: 21.647 s <<< FAILURE! - in org.apache.flink.queryablestate.itcases.HAQueryableStateFsBackendITCase
      [ERROR] testCustomKryoSerializerHandling(org.apache.flink.queryablestate.itcases.HAQueryableStateFsBackendITCase)  Time elapsed: 10.99 s  <<< ERROR!
      java.util.concurrent.ExecutionException: java.util.concurrent.TimeoutException: Invocation of public abstract java.util.concurrent.CompletableFuture org.apache.flink.runtime.dispatcher.DispatcherGateway.submitJob(org.apache.flink.runtime.jobgraph.JobGraph,org.apache.flink.api.common.time.Time) timed out.
      	at java.util.concurrent.CompletableFuture.reportGet(CompletableFuture.java:357)
      	at java.util.concurrent.CompletableFuture.get(CompletableFuture.java:1908)
      	at org.apache.flink.queryablestate.itcases.AbstractQueryableStateTestBase.testCustomKryoSerializerHandling(AbstractQueryableStateTestBase.java:425)
      	at sun.reflect.NativeMethodAccessorImpl.invoke0(Native Method)
      	at sun.reflect.NativeMethodAccessorImpl.invoke(NativeMethodAccessorImpl.java:62)
      	at sun.reflect.DelegatingMethodAccessorImpl.invoke(DelegatingMethodAccessorImpl.java:43)
      	at java.lang.reflect.Method.invoke(Method.java:498)
      	at org.junit.runners.model.FrameworkMethod$1.runReflectiveCall(FrameworkMethod.java:50)
      	at org.junit.internal.runners.model.ReflectiveCallable.run(ReflectiveCallable.java:12)
      	at org.junit.runners.model.FrameworkMethod.invokeExplosively(FrameworkMethod.java:47)
      	at org.junit.internal.runners.statements.InvokeMethod.evaluate(InvokeMethod.java:17)
      	at org.junit.internal.runners.statements.RunBefores.evaluate(RunBefores.java:26)
      	at org.junit.rules.TestWatcher$1.evaluate(TestWatcher.java:55)
      	at org.junit.rules.RunRules.evaluate(RunRules.java:20)
      	at org.junit.runners.ParentRunner.runLeaf(ParentRunner.java:325)
      	at org.junit.runners.BlockJUnit4ClassRunner.runChild(BlockJUnit4ClassRunner.java:78)
      	at org.junit.runners.BlockJUnit4ClassRunner.runChild(BlockJUnit4ClassRunner.java:57)
      	at org.junit.runners.ParentRunner$3.run(ParentRunner.java:290)
      	at org.junit.runners.ParentRunner$1.schedule(ParentRunner.java:71)
      	at org.junit.runners.ParentRunner.runChildren(ParentRunner.java:288)
      	at org.junit.runners.ParentRunner.access$000(ParentRunner.java:58)
      	at org.junit.runners.ParentRunner$2.evaluate(ParentRunner.java:268)
      	at org.junit.internal.runners.statements.RunBefores.evaluate(RunBefores.java:26)
      	at org.junit.internal.runners.statements.RunAfters.evaluate(RunAfters.java:27)
      	at org.junit.rules.ExternalResource$1.evaluate(ExternalResource.java:48)
      	at org.junit.rules.ExternalResource$1.evaluate(ExternalResource.java:48)
      	at org.junit.rules.RunRules.evaluate(RunRules.java:20)
      	at org.junit.runners.ParentRunner.run(ParentRunner.java:363)
      	at org.apache.maven.surefire.junit4.JUnit4Provider.execute(JUnit4Provider.java:365)
      	at org.apache.maven.surefire.junit4.JUnit4Provider.executeWithRerun(JUnit4Provider.java:273)
      	at org.apache.maven.surefire.junit4.JUnit4Provider.executeTestSet(JUnit4Provider.java:238)
      	at org.apache.maven.surefire.junit4.JUnit4Provider.invoke(JUnit4Provider.java:159)
      	at org.apache.maven.surefire.booter.ForkedBooter.invokeProviderInSameClassLoader(ForkedBooter.java:384)
      	at org.apache.maven.surefire.booter.ForkedBooter.runSuitesInProcess(ForkedBooter.java:345)
      	at org.apache.maven.surefire.booter.ForkedBooter.execute(ForkedBooter.java:126)
      	at org.apache.maven.surefire.booter.ForkedBooter.main(ForkedBooter.java:418)
      Caused by: java.util.concurrent.TimeoutException: Invocation of public abstract java.util.concurrent.CompletableFuture org.apache.flink.runtime.dispatcher.DispatcherGateway.submitJob(org.apache.flink.runtime.jobgraph.JobGraph,org.apache.flink.api.common.time.Time) timed out.
      	at com.sun.proxy.$Proxy35.submitJob(Unknown Source)
      	at org.apache.flink.runtime.minicluster.MiniCluster.lambda$submitJob$14(MiniCluster.java:829)
      	at java.util.concurrent.CompletableFuture.biApply(CompletableFuture.java:1119)
      	at java.util.concurrent.CompletableFuture$BiApply.tryFire(CompletableFuture.java:1084)
      	at java.util.concurrent.CompletableFuture.postComplete(CompletableFuture.java:488)
      	at java.util.concurrent.CompletableFuture.complete(CompletableFuture.java:1975)
      	at org.apache.flink.runtime.rpc.akka.AkkaInvocationHandler.lambda$invokeRpc$0(AkkaInvocationHandler.java:237)
      	at java.util.concurrent.CompletableFuture.uniWhenComplete(CompletableFuture.java:774)
      	at java.util.concurrent.CompletableFuture$UniWhenComplete.tryFire(CompletableFuture.java:750)
      	at java.util.concurrent.CompletableFuture.postComplete(CompletableFuture.java:488)
      	at java.util.concurrent.CompletableFuture.complete(CompletableFuture.java:1975)
      	at org.apache.flink.runtime.concurrent.FutureUtils$1.onComplete(FutureUtils.java:1061)
      	at akka.dispatch.OnComplete.internal(Future.scala:264)
      	at akka.dispatch.OnComplete.internal(Future.scala:261)
      	at akka.dispatch.japi$CallbackBridge.apply(Future.scala:191)
      	at akka.dispatch.japi$CallbackBridge.apply(Future.scala:188)
      	at scala.concurrent.impl.CallbackRunnable.run(Promise.scala:36)
      	at org.apache.flink.runtime.concurrent.Executors$DirectExecutionContext.execute(Executors.java:73)
      	at scala.concurrent.impl.CallbackRunnable.executeWithValue(Promise.scala:44)
      	at scala.concurrent.impl.Promise$DefaultPromise.tryComplete(Promise.scala:252)
      	at akka.pattern.PromiseActorRef.$bang(AskSupport.scala:572)
      	at akka.pattern.PipeToSupport$PipeableFuture$$anonfun$pipeTo$1.applyOrElse(PipeToSupport.scala:22)
      	at akka.pattern.PipeToSupport$PipeableFuture$$anonfun$pipeTo$1.applyOrElse(PipeToSupport.scala:21)
      	at scala.concurrent.Future$$anonfun$andThen$1.apply(Future.scala:436)
      	at scala.concurrent.Future$$anonfun$andThen$1.apply(Future.scala:435)
      	at scala.concurrent.impl.CallbackRunnable.run(Promise.scala:36)
      	at akka.dispatch.BatchingExecutor$AbstractBatch.processBatch(BatchingExecutor.scala:55)
      	at akka.dispatch.BatchingExecutor$BlockableBatch$$anonfun$run$1.apply$mcV$sp(BatchingExecutor.scala:91)
      	at akka.dispatch.BatchingExecutor$BlockableBatch$$anonfun$run$1.apply(BatchingExecutor.scala:91)
      	at akka.dispatch.BatchingExecutor$BlockableBatch$$anonfun$run$1.apply(BatchingExecutor.scala:91)
      	at scala.concurrent.BlockContext$.withBlockContext(BlockContext.scala:72)
      	at akka.dispatch.BatchingExecutor$BlockableBatch.run(BatchingExecutor.scala:90)
      	at akka.dispatch.TaskInvocation.run(AbstractDispatcher.scala:40)
      	at akka.dispatch.ForkJoinExecutorConfigurator$AkkaForkJoinTask.exec(ForkJoinExecutorConfigurator.scala:44)
      	at akka.dispatch.forkjoin.ForkJoinTask.doExec(ForkJoinTask.java:260)
      	at akka.dispatch.forkjoin.ForkJoinPool$WorkQueue.runTask(ForkJoinPool.java:1339)
      	at akka.dispatch.forkjoin.ForkJoinPool.runWorker(ForkJoinPool.java:1979)
      	at akka.dispatch.forkjoin.ForkJoinWorkerThread.run(ForkJoinWorkerThread.java:107)
      Caused by: akka.pattern.AskTimeoutException: Ask timed out on [Actor[akka://flink/user/rpc/dispatcher_3#734390508]] after [10000 ms]. Message of type [org.apache.flink.runtime.rpc.messages.LocalFencedMessage]. A typical reason for `AskTimeoutException` is that the recipient actor didn't send a reply.
      	at akka.pattern.PromiseActorRef$$anonfun$2.apply(AskSupport.scala:635)
      	at akka.pattern.PromiseActorRef$$anonfun$2.apply(AskSupport.scala:635)
      	at akka.pattern.PromiseActorRef$$anonfun$1.apply$mcV$sp(AskSupport.scala:648)
      	at akka.actor.Scheduler$$anon$4.run(Scheduler.scala:205)
      	at scala.concurrent.Future$InternalCallbackExecutor$.unbatchedExecute(Future.scala:601)
      	at scala.concurrent.BatchingExecutor$class.execute(BatchingExecutor.scala:109)
      	at scala.concurrent.Future$InternalCallbackExecutor$.execute(Future.scala:599)
      	at akka.actor.LightArrayRevolverScheduler$TaskHolder.executeTask(LightArrayRevolverScheduler.scala:328)
      	at akka.actor.LightArrayRevolverScheduler$$anon$4.executeBucket$1(LightArrayRevolverScheduler.scala:279)
      	at akka.actor.LightArrayRevolverScheduler$$anon$4.nextTick(LightArrayRevolverScheduler.scala:283)
      	at akka.actor.LightArrayRevolverScheduler$$anon$4.run(LightArrayRevolverScheduler.scala:235)
      	at java.lang.Thread.run(Thread.java:748)
      

      Attachments

        Issue Links

        Activity

          This comment will be Viewable by All Users Viewable by All Users
          Cancel

          People

            Unassigned Unassigned
            xtsong Xintong Song
            Votes:
            0 Vote for this issue
            Watchers:
            2 Start watching this issue

            Dates

              Created:
              Updated:
              Resolved:

              Issue deployment