Uploaded image for project: 'Flink'
  1. Flink
  2. FLINK-20950

SinkITCase.writerAndGlobalCommitterExecuteInStreamingMode test failed with "AssertionError"

    XMLWordPrintableJSON

    Details

      Description

      https://dev.azure.com/apache-flink/apache-flink/_build/results?buildId=11940&view=logs&j=34f41360-6c0d-54d3-11a1-0292a2def1d9&t=2d56e022-1ace-542f-bf1a-b37dd63243f2

      2021-01-12T16:47:00.7579536Z [ERROR] Failures: 
      2021-01-12T16:47:00.7580061Z [ERROR]   SinkITCase.writerAndGlobalCommitterExecuteInStreamingMode:218 
      2021-01-12T16:47:00.7587186Z Expected: iterable over ["(895,null,-9223372036854775808)", "(895,null,-9223372036854775808)", "(127,null,-9223372036854775808)", "(127,null,-9223372036854775808)", "(148,null,-9223372036854775808)", "(148,null,-9223372036854775808)", "(161,null,-9223372036854775808)", "(161,null,-9223372036854775808)", "(148,null,-9223372036854775808)", "(148,null,-9223372036854775808)", "(662,null,-9223372036854775808)", "(662,null,-9223372036854775808)", "(822,null,-9223372036854775808)", "(822,null,-9223372036854775808)", "(491,null,-9223372036854775808)", "(491,null,-9223372036854775808)", "(275,null,-9223372036854775808)", "(275,null,-9223372036854775808)", "(122,null,-9223372036854775808)", "(122,null,-9223372036854775808)", "(850,null,-9223372036854775808)", "(850,null,-9223372036854775808)", "(630,null,-9223372036854775808)", "(630,null,-9223372036854775808)", "(682,null,-9223372036854775808)", "(682,null,-9223372036854775808)", "(765,null,-9223372036854775808)", "(765,null,-9223372036854775808)", "(434,null,-9223372036854775808)", "(434,null,-9223372036854775808)", "(970,null,-9223372036854775808)", "(970,null,-9223372036854775808)", "(714,null,-9223372036854775808)", "(714,null,-9223372036854775808)", "(795,null,-9223372036854775808)", "(795,null,-9223372036854775808)", "(288,null,-9223372036854775808)", "(288,null,-9223372036854775808)", "(422,null,-9223372036854775808)", "(422,null,-9223372036854775808)"] in any order
      2021-01-12T16:47:00.7591663Z      but: Not matched: "end of input"
      

        Attachments

          Issue Links

            Activity

              People

              • Assignee:
                Unassigned
                Reporter:
                hxbks2ks Huang Xingbo
              • Votes:
                0 Vote for this issue
                Watchers:
                4 Start watching this issue

                Dates

                • Created:
                  Updated:
                  Resolved: