Uploaded image for project: 'Flink'
  1. Flink
  2. FLINK-15811

StreamSourceOperatorWatermarksTest.testNoMaxWatermarkOnAsyncCancel fails on Travis

Agile BoardRank to TopRank to BottomAttach filesAttach ScreenshotBulk Copy AttachmentsBulk Move AttachmentsVotersWatch issueWatchersCreate sub-taskConvert to sub-taskLinkCloneLabelsUpdate Comment AuthorReplace String in CommentUpdate Comment VisibilityDelete Comments
    XMLWordPrintableJSON

Details

    Description

      https://api.travis-ci.org/v3/job/643480766/log.txt

      08:06:17.382 [ERROR] Tests run: 5, Failures: 1, Errors: 0, Skipped: 0, Time elapsed: 1.812 s <<< FAILURE! - in org.apache.flink.streaming.runtime.operators.StreamSourceOperatorWatermarksTest
      08:06:17.382 [ERROR] testNoMaxWatermarkOnAsyncCancel(org.apache.flink.streaming.runtime.operators.StreamSourceOperatorWatermarksTest)  Time elapsed: 0.235 s  <<< FAILURE!
      java.lang.AssertionError
      	at org.apache.flink.streaming.runtime.operators.StreamSourceOperatorWatermarksTest.testNoMaxWatermarkOnAsyncCancel(StreamSourceOperatorWatermarksTest.java:127)
      

      Attachments

        Activity

          This comment will be Viewable by All Users Viewable by All Users
          Cancel

          People

            roman Roman Khachatryan
            chesnay Chesnay Schepler
            Votes:
            0 Vote for this issue
            Watchers:
            7 Start watching this issue

            Dates

              Created:
              Updated:
              Resolved:

              Time Tracking

              Estimated:
              Original Estimate - Not Specified
              Not Specified
              Remaining:
              Remaining Estimate - 0h
              0h
              Logged:
              Time Spent - 20m
              20m

              Slack

                Issue deployment