Uploaded image for project: 'Flink'
  1. Flink
  2. FLINK-11168

LargePlanTest times out on Travis

    XMLWordPrintableJSON

    Details

      Description

      The newly added LargePlanTest has timed out on Travis: https://travis-ci.org/apache/flink/jobs/467949929

      13:58:43.593 [ERROR] Tests run: 1, Failures: 0, Errors: 1, Skipped: 0, Time elapsed: 15.201 s <<< FAILURE! - in org.apache.flink.test.planning.LargePlanTest
      13:58:43.599 [ERROR] testPlanningOfLargePlan(org.apache.flink.test.planning.LargePlanTest)  Time elapsed: 15.028 s  <<< ERROR!
      org.junit.runners.model.TestTimedOutException: test timed out after 15000 milliseconds
      	at org.apache.flink.test.planning.LargePlanTest.runProgram(LargePlanTest.java:51)
      	at org.apache.flink.test.planning.LargePlanTest.testPlanningOfLargePlan(LargePlanTest.java:39)
      

      FYI Maximilian Michels

        Attachments

          Issue Links

            Activity

              People

              • Assignee:
                mxm Maximilian Michels
                Reporter:
                chesnay Chesnay Schepler
              • Votes:
                0 Vote for this issue
                Watchers:
                1 Start watching this issue

                Dates

                • Created:
                  Updated:
                  Resolved:

                  Time Tracking

                  Estimated:
                  Original Estimate - Not Specified
                  Not Specified
                  Remaining:
                  Remaining Estimate - 0h
                  0h
                  Logged:
                  Time Spent - 20m
                  20m