Details

    • Type: Sub-task
    • Status: Closed
    • Priority: Minor
    • Resolution: Fixed
    • Affects Version/s: 1.18.0
    • Fix Version/s: Future
    • Component/s: None
    • Labels:
      None

      Description

      Warning:  Tests run: 4922, Failures: 0, Errors: 0, Skipped: 146
      2267[INFO] 
      2268[INFO] ------------------------------------------------------------------------
      2269[INFO] Reactor Summary for Drill : 1.19.0-SNAPSHOT:
      2270[INFO] 
      2271[INFO] Drill : ............................................ SUCCESS [ 19.690 s]
      2272[INFO] Drill : Tools : .................................... SUCCESS [  0.582 s]
      2273[INFO] Drill : Tools : Freemarker codegen ................. SUCCESS [  8.634 s]
      2274[INFO] Drill : Protocol ................................... SUCCESS [  9.052 s]
      2275[INFO] Drill : Common ..................................... SUCCESS [ 11.695 s]
      2276[INFO] Drill : Logical Plan ............................... SUCCESS [ 12.554 s]
      2277[INFO] Drill : Exec : ..................................... SUCCESS [  0.348 s]
      2278[INFO] Drill : Exec : Memory : ............................ SUCCESS [  0.321 s]
      2279[INFO] Drill : Exec : Memory : Base ....................... SUCCESS [  7.293 s]
      2280[INFO] Drill : Exec : RPC ................................. SUCCESS [  4.397 s]
      2281[INFO] Drill : Exec : Vectors ............................. SUCCESS [01:37 min]
      2282[INFO] Drill : Contrib : .................................. SUCCESS [  0.363 s]
      2283[INFO] Drill : Contrib : Data : ........................... SUCCESS [  0.336 s]
      2284[INFO] Drill : Contrib : Data : TPCH Sample ............... SUCCESS [  2.583 s]
      2285[INFO] Drill : Metastore : ................................ SUCCESS [  0.360 s]
      2286[INFO] Drill : Metastore : API ............................ SUCCESS [ 11.939 s]
      2287[INFO] Drill : Metastore : Iceberg ........................ SUCCESS [ 26.519 s]
      2288[INFO] Drill : Exec : Java Execution Engine ............... FAILURE [57:19 min]
      2289[INFO] Drill : Exec : JDBC Driver using dependencies ...... SKIPPED
      2290[INFO] Drill : Exec : JDBC JAR with all dependencies ...... SKIPPED
      2291[INFO] Drill : On-YARN .................................... SKIPPED
      2292[INFO] Drill : Metastore : RDBMS .......................... SKIPPED
      2293[INFO] Drill : Contrib : Storage : Kudu ................... SKIPPED
      2294[INFO] Drill : Contrib : Format : XML ..................... SKIPPED
      2295[INFO] Drill : Contrib : Storage : HTTP ................... SKIPPED
      2296[INFO] Drill : Contrib : Storage : OpenTSDB ............... SKIPPED
      2297[INFO] Drill : Contrib : Storage : MongoDB ................ SKIPPED
      2298[INFO] Drill : Contrib : Storage : HBase .................. SKIPPED
      2299[INFO] Drill : Contrib : Storage : JDBC ................... SKIPPED
      2300[INFO] Drill : Contrib : Storage : Hive : ................. SKIPPED
      2301[INFO] Drill : Contrib : Storage : Hive : Exec Shaded ..... SKIPPED
      2302[INFO] Drill : Contrib : Storage : Hive : Core ............ SKIPPED
      2303[INFO] Drill : Contrib : Storage : Kafka .................. SKIPPED
      2304[INFO] Drill : Contrib : Storage : Cassandra .............. SKIPPED
      2305[INFO] Drill : Contrib : Storage : ElasticSearch .......... SKIPPED
      2306[INFO] Drill : Contrib : Storage : Splunk ................. SKIPPED
      2307[INFO] Drill : Contrib : UDFs ............................. SKIPPED
      2308[INFO] Drill : Contrib : Format : Syslog .................. SKIPPED
      2309[INFO] Drill : Contrib : Format : Httpd/Nginx Access Log .. SKIPPED
      2310[INFO] Drill : Contrib : Format : HDF5 .................... SKIPPED
      2311[INFO] Drill : Contrib : Format : SPSS .................... SKIPPED
      2312[INFO] Drill : Contrib : Format : LTSV .................... SKIPPED
      2313[INFO] Drill : Contrib : Format : Image ................... SKIPPED
      2314[INFO] Drill : Contrib : Format : Pcap-NG ................. SKIPPED
      2315[INFO] Drill : Contrib : Format : Esri .................... SKIPPED
      2316[INFO] Drill : Contrib : Format : Excel ................... SKIPPED
      2317[INFO] Drill : Contrib : Storage : Druid .................. SKIPPED
      2318[INFO] Drill : Packaging and Distribution Assembly ........ SKIPPED
      2319[INFO] Drill : Contrib : Format : MaprDB .................. SKIPPED
      2320[INFO] ------------------------------------------------------------------------
      2321[INFO] BUILD FAILURE
      2322[INFO] ------------------------------------------------------------------------
      2323[INFO] Total time:  01:00 h
      2324[INFO] Finished at: 2021-05-16T21:18:05Z
      2325[INFO] ------------------------------------------------------------------------
      2326Error:  Failed to execute goal org.apache.maven.plugins:maven-surefire-plugin:3.0.0-M4:test (default-test) on project drill-java-exec: There are test failures.
      2327Error:  
      2328Error:  Please refer to /home/runner/work/drill/drill/exec/java-exec/target/surefire-reports for the individual test results.
      2329Error:  Please refer to dump files (if any exist) [date].dump, [date]-jvmRun[N].dump and [date].dumpstream.
      2330Error:  ExecutionException The forked VM terminated without properly saying goodbye. VM crash or System.exit called?
      2331Error:  Command was /bin/sh -c cd /home/runner/work/drill/drill/exec/java-exec && /usr/lib/jvm/adoptopenjdk-8-hotspot-amd64/jre/bin/java -Xms512m -Xmx1300m -Ddrill.exec.http.enabled=false -Ddrill.exec.memory.enable_unsafe_bounds_check=true -Ddrill.exec.sys.store.provider.local.write=false -Dorg.apache.drill.exec.server.Drillbit.system_options=org.apache.drill.exec.compile.ClassTransformer.scalar_replacement=on -Ddrill.catastrophic_to_standard_out=true -XX:MaxDirectMemorySize=4500M -Djava.net.preferIPv4Stack=true -Djava.awt.headless=true -XX:+CMSClassUnloadingEnabled -ea -Djdk.attach.allowAttachSelf=true -javaagent:/home/runner/.m2/repository/org/jmockit/jmockit/1.47/jmockit-1.47.jar org.apache.maven.surefire.booter.ForkedBooter /home/runner/work/drill/drill/exec/java-exec/target/surefire 2021-05-16T20-17-40_188-jvmRun2 surefire2023446400383515366tmp surefire_132867754569663292391tmp
      2332Error:  Error occurred in starting fork, check output in log
      2333Error:  Process Exit Code: 255
      2334Error:  Crashed tests:
      2335Error:  org.apache.drill.exec.fn.impl.TestAggregateFunctions
      2336Error:  org.apache.maven.surefire.booter.SurefireBooterForkException: ExecutionException The forked VM terminated without properly saying goodbye. VM crash or System.exit called?
      2337Error:  Command was /bin/sh -c cd /home/runner/work/drill/drill/exec/java-exec && /usr/lib/jvm/adoptopenjdk-8-hotspot-amd64/jre/bin/java -Xms512m -Xmx1300m -Ddrill.exec.http.enabled=false -Ddrill.exec.memory.enable_unsafe_bounds_check=true -Ddrill.exec.sys.store.provider.local.write=false -Dorg.apache.drill.exec.server.Drillbit.system_options=org.apache.drill.exec.compile.ClassTransformer.scalar_replacement=on -Ddrill.catastrophic_to_standard_out=true -XX:MaxDirectMemorySize=4500M -Djava.net.preferIPv4Stack=true -Djava.awt.headless=true -XX:+CMSClassUnloadingEnabled -ea -Djdk.attach.allowAttachSelf=true -javaagent:/home/runner/.m2/repository/org/jmockit/jmockit/1.47/jmockit-1.47.jar org.apache.maven.surefire.booter.ForkedBooter /home/runner/work/drill/drill/exec/java-exec/target/surefire 2021-05-16T20-17-40_188-jvmRun2 surefire2023446400383515366tmp surefire_132867754569663292391tmp
      2338Error:  Error occurred in starting fork, check output in log
      2339Error:  Process Exit Code: 255
      2340Error:  Crashed tests:
      2341Error:  org.apache.drill.exec.fn.impl.TestAggregateFunctions
      2342Error:  	at org.apache.maven.plugin.surefire.booterclient.ForkStarter.awaitResultsDone(ForkStarter.java:513)
      2343Error:  	at org.apache.maven.plugin.surefire.booterclient.ForkStarter.runSuitesForkOnceMultiple(ForkStarter.java:385)
      2344Error:  	at org.apache.maven.plugin.surefire.booterclient.ForkStarter.run(ForkStarter.java:300)
      2345Error:  	at org.apache.maven.plugin.surefire.booterclient.ForkStarter.run(ForkStarter.java:249)
      2346Error:  	at org.apache.maven.plugin.surefire.AbstractSurefireMojo.executeProvider(AbstractSurefireMojo.java:1217)
      2347Error:  	at org.apache.maven.plugin.surefire.AbstractSurefireMojo.executeAfterPreconditionsChecked(AbstractSurefireMojo.java:1063)
      2348Error:  	at org.apache.maven.plugin.surefire.AbstractSurefireMojo.execute(AbstractSurefireMojo.java:889)
      2349Error:  	at org.apache.maven.plugin.DefaultBuildPluginManager.executeMojo(DefaultBuildPluginManager.java:137)
      2350Error:  	at org.apache.maven.lifecycle.internal.MojoExecutor.execute(MojoExecutor.java:210)
      2351Error:  	at org.apache.maven.lifecycle.internal.MojoExecutor.execute(MojoExecutor.java:156)
      2352Error:  	at org.apache.maven.lifecycle.internal.MojoExecutor.execute(MojoExecutor.java:148)
      2353Error:  	at org.apache.maven.lifecycle.internal.LifecycleModuleBuilder.buildProject(LifecycleModuleBuilder.java:117)
      2354Error:  	at org.apache.maven.lifecycle.internal.LifecycleModuleBuilder.buildProject(LifecycleModuleBuilder.java:81)
      2355Error:  	at org.apache.maven.lifecycle.internal.builder.singlethreaded.SingleThreadedBuilder.build(SingleThreadedBuilder.java:56)
      2356Error:  	at org.apache.maven.lifecycle.internal.LifecycleStarter.execute(LifecycleStarter.java:128)
      2357Error:  	at org.apache.maven.DefaultMaven.doExecute(DefaultMaven.java:305)
      2358Error:  	at org.apache.maven.DefaultMaven.doExecute(DefaultMaven.java:192)
      2359Error:  	at org.apache.maven.DefaultMaven.execute(DefaultMaven.java:105)
      2360Error:  	at org.apache.maven.cli.MavenCli.execute(MavenCli.java:957)
      2361Error:  	at org.apache.maven.cli.MavenCli.doMain(MavenCli.java:289)
      2362Error:  	at org.apache.maven.cli.MavenCli.main(MavenCli.java:193)
      2363Error:  	at sun.reflect.NativeMethodAccessorImpl.invoke0(Native Method)
      2364Error:  	at sun.reflect.NativeMethodAccessorImpl.invoke(NativeMethodAccessorImpl.java:62)
      2365Error:  	at sun.reflect.DelegatingMethodAccessorImpl.invoke(DelegatingMethodAccessorImpl.java:43)
      2366Error:  	at java.lang.reflect.Method.invoke(Method.java:498)
      2367Error:  	at org.codehaus.plexus.classworlds.launcher.Launcher.launchEnhanced(Launcher.java:282)
      2368Error:  	at org.codehaus.plexus.classworlds.launcher.Launcher.launch(Launcher.java:225)
      2369Error:  	at org.codehaus.plexus.classworlds.launcher.Launcher.mainWithExitCode(Launcher.java:406)
      2370Error:  	at org.codehaus.plexus.classworlds.launcher.Launcher.main(Launcher.java:347)
      2371Error:  Caused by: org.apache.maven.surefire.booter.SurefireBooterForkException: The forked VM terminated without properly saying goodbye. VM crash or System.exit called?
      2372Error:  Command was /bin/sh -c cd /home/runner/work/drill/drill/exec/java-exec && /usr/lib/jvm/adoptopenjdk-8-hotspot-amd64/jre/bin/java -Xms512m -Xmx1300m -Ddrill.exec.http.enabled=false -Ddrill.exec.memory.enable_unsafe_bounds_check=true -Ddrill.exec.sys.store.provider.local.write=false -Dorg.apache.drill.exec.server.Drillbit.system_options=org.apache.drill.exec.compile.ClassTransformer.scalar_replacement=on -Ddrill.catastrophic_to_standard_out=true -XX:MaxDirectMemorySize=4500M -Djava.net.preferIPv4Stack=true -Djava.awt.headless=true -XX:+CMSClassUnloadingEnabled -ea -Djdk.attach.allowAttachSelf=true -javaagent:/home/runner/.m2/repository/org/jmockit/jmockit/1.47/jmockit-1.47.jar org.apache.maven.surefire.booter.ForkedBooter /home/runner/work/drill/drill/exec/java-exec/target/surefire 2021-05-16T20-17-40_188-jvmRun2 surefire2023446400383515366tmp surefire_132867754569663292391tmp
      2373Error:  Error occurred in starting fork, check output in log
      2374Error:  Process Exit Code: 255
      2375Error:  Crashed tests:
      2376Error:  org.apache.drill.exec.fn.impl.TestAggregateFunctions
      2377Error:  	at org.apache.maven.plugin.surefire.booterclient.ForkStarter.fork(ForkStarter.java:690)
      2378Error:  	at org.apache.maven.plugin.surefire.booterclient.ForkStarter.access$600(ForkStarter.java:118)
      2379Error:  	at org.apache.maven.plugin.surefire.booterclient.ForkStarter$1.call(ForkStarter.java:374)
      2380Error:  	at org.apache.maven.plugin.surefire.booterclient.ForkStarter$1.call(ForkStarter.java:350)
      2381Error:  	at java.util.concurrent.FutureTask.run(FutureTask.java:266)
      2382Error:  	at java.util.concurrent.ThreadPoolExecutor.runWorker(ThreadPoolExecutor.java:1149)
      2383Error:  	at java.util.concurrent.ThreadPoolExecutor$Worker.run(ThreadPoolExecutor.java:624)
      2384Error:  	at java.lang.Thread.run(Thread.java:748)
      2385Error:  
      2386Error:  -> [Help 1]
      2387Error:  
      2388Error:  To see the full stack trace of the errors, re-run Maven with the -e switch.
      2389Error:  Re-run Maven using the -X switch to enable full debug logging.
      2390Error:  
      2391Error:  For more information about the errors and possible solutions, please read the following articles:
      2392Error:  [Help 1] http://cwiki.apache.org/confluence/display/MAVEN/MojoExecutionException
      2393Error:  
      2394Error:  After correcting the problems, you can resume the build with the command
      2395Error:    mvn <args> -rf :drill-java-exec
      2396Error: Process completed with exit code 1.
      

        Attachments

          Activity

            People

            • Assignee:
              vitalii Vitalii Diravka
              Reporter:
              vitalii Vitalii Diravka
            • Votes:
              0 Vote for this issue
              Watchers:
              2 Start watching this issue

              Dates

              • Created:
                Updated:
                Resolved: