Description
Full test name:
com/sun/ts/tests/jaxrs/ee/rs/pathparam/locator/JAXRSLocatorClient#pathParamSetEntityWithFromStringTest_from_standalone
Running it locally:
git clone git@github.com:tckwork/cxf.git cd cxf ./runtests com/sun/ts/tests/jaxrs/ee/rs/pathparam/locator/JAXRSLocatorClient#pathParamSetEntityWithFromStringTest_from_standalone
At the time this issue was filed, the test failed with the following output.
[javatest.batch] [WebValidatorBase] Server's response: [javatest.batch] ------------------------------------------- [javatest.batch] WebApplicationExceptionMapper|status=METHOD_NOT_ALLOWED [javatest.batch] ------------------------------------------- [javatest.batch] [javatest.batch] 04-15-2021 21:41:41: ERROR: Test case throws exception: [JAXRSCommonClient] null failed! Check output for cause of failure. [javatest.batch] 04-15-2021 21:41:41: ERROR: Exception at: [javatest.batch] 04-15-2021 21:41:41: ERROR: com.sun.ts.tests.common.webclient.TestFailureException: Test FAILED! [javatest.batch] at com.sun.ts.tests.common.webclient.WebTestCase.execute(WebTestCase.java:180) [javatest.batch] at com.sun.ts.tests.jaxrs.common.JAXRSCommonClient.invoke(JAXRSCommonClient.java:307) [javatest.batch] at com.sun.ts.tests.jaxrs.ee.rs.JaxrsParamClient.buildRequestAndInvoke(JaxrsParamClient.java:294) [javatest.batch] at com.sun.ts.tests.jaxrs.ee.rs.JaxrsParamClient.paramEntity(JaxrsParamClient.java:309) [javatest.batch] at com.sun.ts.tests.jaxrs.ee.rs.JaxrsParamClient.fieldOrParamEntityName(JaxrsParamClient.java:68) [javatest.batch] at com.sun.ts.tests.jaxrs.ee.rs.JaxrsParamClient.paramCollectionEntityWithFromStringTest(JaxrsParamClient.java:112) [javatest.batch] at com.sun.ts.tests.jaxrs.ee.rs.pathparam.JAXRSClient.pathParamSetEntityWithFromStringTest(JAXRSClient.java:244) [javatest.batch] at com.sun.ts.tests.jaxrs.ee.rs.pathparam.locator.JAXRSLocatorClient.pathParamSetEntityWithFromStringTest(JAXRSLocatorClient.java:173) [javatest.batch] at sun.reflect.NativeMethodAccessorImpl.invoke0(Native Method) [javatest.batch] at sun.reflect.NativeMethodAccessorImpl.invoke(NativeMethodAccessorImpl.java:62) [javatest.batch] at sun.reflect.DelegatingMethodAccessorImpl.invoke(DelegatingMethodAccessorImpl.java:43) [javatest.batch] at java.lang.reflect.Method.invoke(Method.java:498) [javatest.batch] at com.sun.ts.lib.harness.EETest.run(EETest.java:596) [javatest.batch] at com.sun.ts.lib.harness.ServiceEETest.run(ServiceEETest.java:115) [javatest.batch] at com.sun.ts.tests.common.vehicle.EmptyVehicleRunner.run(EmptyVehicleRunner.java:40) [javatest.batch] at com.sun.ts.lib.harness.ServiceEETest.run(ServiceEETest.java:105) [javatest.batch] at com.sun.ts.lib.harness.EETest.getPropsReady(EETest.java:486) [javatest.batch] at com.sun.ts.lib.harness.ServiceEETest.run(ServiceEETest.java:209) [javatest.batch] at com.sun.ts.lib.harness.EETest.run(EETest.java:285) [javatest.batch] at com.sun.ts.tests.common.vehicle.VehicleClient.main(VehicleClient.java:38) [javatest.batch] [javatest.batch] 04-15-2021 21:41:41: [JAXRSCommonClient] Test cleanup OK [javatest.batch] STATUS:Failed.Test case throws exception: [JAXRSCommonClient] null failed! Check output for cause of failure. [javatest.batch] Apr 15, 2021 9:41:43 PM Finished executing all tests, wait for cleanup... [javatest.batch] Apr 15, 2021 9:41:43 PM Harness done with cleanup from test run. [javatest.batch] Failed. Test case throws exception: [JAXRSCommonClient] null failed! Check output for cause of failure. [javatest.batch] ******************************************************************************** [javatest.batch] Finished Test: FAILED........com/sun/ts/tests/jaxrs/ee/rs/pathparam/locator/JAXRSLocatorClient.java#pathParamSetEntityWithFromStringTest_from_standalone
See the attached javatest.log and jtr file for full test details