Uploaded image for project: 'Apache Commons RDF'
  1. Apache Commons RDF
  2. COMMONSRDF-63

AbstractRDFParserTest.parseFile and parseFileContentType broken under Mac OS X

    XMLWordPrintableJSON

    Details

    • Type: Bug
    • Status: Resolved
    • Priority: Critical
    • Resolution: Fixed
    • Affects Version/s: 1.0.0
    • Fix Version/s: 0.5.0
    • Component/s: simple
    • Labels:
      None
    • Environment:

      Description

      mvn clean install -Dcommons.japicmp.breakBuildOnBinaryIncompatibleModifications=false -Djava.io.tmpdir=/path/to/some/directory
      

      results in the following

      Results :
      
      Failed tests:
        AbstractRDFParserTest.parseFile:121 expected:<<file:///[]tmp/test596420984638...> but was:<<file:///[private/]tmp/test596420984638...>
        AbstractRDFParserTest.parseFileContentType:165 expected:<<file:///[]tmp/test517279051678...> but was:<<file:///[private/]tmp/test517279051678...>
      
      Tests run: 87, Failures: 2, Errors: 0, Skipped: 0
      
      [INFO] ------------------------------------------------------------------------
      [INFO] Reactor Summary:
      [INFO]
      [INFO] Commons RDF ........................................ SUCCESS [  3.086 s]
      [INFO] Commons RDF API .................................... SUCCESS [  8.001 s]
      [INFO] Commons RDF impl: Simple ........................... FAILURE [  3.706 s]
      [INFO] Commons RDF impl: RDF4j ............................ SKIPPED
      [INFO] Commons RDF impl: Jena ............................. SKIPPED
      [INFO] Commons RDF impl: JSON-LD Java ..................... SKIPPED
      [INFO] Commons RDF Integration tests ...................... SKIPPED
      [INFO] ------------------------------------------------------------------------
      [INFO] BUILD FAILURE
      [INFO] ------------------------------------------------------------------------
      [INFO] Total time: 15.042 s
      [INFO] Finished at: 2017-09-12T16:20:45-07:00
      [INFO] Final Memory: 47M/721M
      [INFO] ------------------------------------------------------------------------
      [ERROR] Failed to execute goal org.apache.maven.plugins:maven-surefire-plugin:2.19.1:test (default-test) on project commons-rdf-simple: There are test failures.
      [ERROR]
      [ERROR] Please refer to /usr/local/commons-rdf/simple/target/surefire-reports for the individual test results.
      [ERROR] -> [Help 1]
      [ERROR]
      [ERROR] To see the full stack trace of the errors, re-run Maven with the -e switch.
      [ERROR] Re-run Maven using the -X switch to enable full debug logging.
      [ERROR]
      [ERROR] For more information about the errors and possible solutions, please read the following articles:
      [ERROR] [Help 1] http://cwiki.apache.org/confluence/display/MAVEN/MojoFailureException
      [ERROR]
      [ERROR] After correcting the problems, you can resume the build with the command
      [ERROR]   mvn <goals> -rf :commons-rdf-simple
      

        Attachments

          Activity

            People

            • Assignee:
              stain Stian Soiland-Reyes
              Reporter:
              lewismc Lewis John McGibbney
            • Votes:
              0 Vote for this issue
              Watchers:
              2 Start watching this issue

              Dates

              • Created:
                Updated:
                Resolved: