Uploaded image for project: 'Apache Cordova'
  1. Apache Cordova
  2. CB-11943

:CordovaLib:processDebugResources FAILED

    XMLWordPrintableJSON

    Details

      Description

      :CordovaLib:processDebugResources FAILED
      15:56:32.082 [INFO] [org.gradle.execution.taskgraph.AbstractTaskPlanExecutor] :CordovaLib:processDebugResources (Thread[main,5,main]) completed. Took 2.964 secs.
      15:56:32.082 [DEBUG] [org.gradle.execution.taskgraph.AbstractTaskPlanExecutor] Task worker [Thread[main,5,main]] finished, busy: 3.314 secs, idle: 0.505 secs
      15:56:32.092 [ERROR] [org.gradle.BuildExceptionReporter]
      15:56:32.092 [ERROR] [org.gradle.BuildExceptionReporter] FAILURE: Build failed with an exception.
      15:56:32.092 [ERROR] [org.gradle.BuildExceptionReporter]
      15:56:32.092 [ERROR] [org.gradle.BuildExceptionReporter] * What went wrong:
      15:56:32.092 [ERROR] [org.gradle.BuildExceptionReporter] Execution failed for task ':CordovaLib:processDebugResources'.
      15:56:32.092 [ERROR] [org.gradle.BuildExceptionReporter] > com.android.ide.common.process.ProcessException: org.gradle.process.internal.ExecException: Process 'command 'C:\Users\niitadmin\AppData\Local\Android\sdk\build-tools\24.0.3\aapt.exe'' finished with non-zero exit value -1073741819
      15:56:32.092 [ERROR] [org.gradle.BuildExceptionReporter]
      15:56:32.092 [ERROR] [org.gradle.BuildExceptionReporter] * Try:
      15:56:32.092 [ERROR] [org.gradle.BuildExceptionReporter] Run with --stacktrace option to get the stack trace.
      15:56:32.093 [LIFECYCLE] [org.gradle.BuildResultLogger]
      15:56:32.093 [LIFECYCLE] [org.gradle.BuildResAultLogger] BUILD FAILED

        Attachments

          Activity

            People

            • Assignee:
              Unassigned
              Reporter:
              gourav7bhatia Gourav
            • Votes:
              0 Vote for this issue
              Watchers:
              2 Start watching this issue

              Dates

              • Created:
                Updated:
                Resolved: