Uploaded image for project: 'Apache Cordova'
  1. Apache Cordova
  2. CB-11610

Clean and Build does not work on NetBeans 8.x

    XMLWordPrintableJSON

    Details

    • Type: Bug
    • Status: Closed
    • Priority: Major
    • Resolution: Not A Problem
    • Affects Version/s: 6.2.0
    • Fix Version/s: None
    • Component/s: cordova-cli
    • Environment:

      Description

      When I launch clean and build, it crash with error:

      Execute failed: java.io.IOException: Cannot run program ".\gradlew"
      

      I think, that on windows it should lanch gradlew.bat, not .\gradlew

      Full log:

      ant -f D:\\NetBeansProjects\\project\\nbproject "-Dupdate.task.jar=C:\\Program Files\\NetBeans 8.1\\webcommon\\ant\\extra\\org-netbeans-modules-cordova-projectupdate.jar" -Dandroid.project.activity=fain -Dsite.root=www -Dstart.file=index.html -Dandroid.sdk.home=D:\\android-sdk -Dandroid.target.device.arg=run -Dcordova.version=6.2.0-0.0.0 -Denv.DISPLAY=:0.0 "-Dios.certificate.name=iPhone Developer" -Dandroid.build.target=android-16 -Dconfig=android_1 rebuild-android
      check-android-template:
      clean-android:
      D:\NetBeansProjects\project\nbproject\build.xml:285: Execute failed: 
      java.io.IOException: Cannot run program ".\gradlew" (in directory "D:\NetBeansProjects\project\platforms\android"): CreateProcess error=2, The system cannot find the file specified
      	at java.lang.ProcessBuilder.start(ProcessBuilder.java:1048)
      	at java.lang.Runtime.exec(Runtime.java:620)
      	at org.apache.tools.ant.taskdefs.launcher.Java13CommandLauncher.exec(Java13CommandLauncher.java:58)
      	at org.apache.tools.ant.taskdefs.Execute.launch(Execute.java:428)
      	at org.apache.tools.ant.taskdefs.Execute.execute(Execute.java:442)
      	at org.apache.tools.ant.taskdefs.ExecTask.runExecute(ExecTask.java:628)
      	at org.apache.tools.ant.taskdefs.ExecTask.runExec(ExecTask.java:669)
      	at org.apache.tools.ant.taskdefs.ExecTask.execute(ExecTask.java:495)
      	at org.apache.tools.ant.UnknownElement.execute(UnknownElement.java:292)
      	at sun.reflect.NativeMethodAccessorImpl.invoke0(Native Method)
      	at sun.reflect.NativeMethodAccessorImpl.invoke(NativeMethodAccessorImpl.java:62)
      	at sun.reflect.DelegatingMethodAccessorImpl.invoke(DelegatingMethodAccessorImpl.java:43)
      	at java.lang.reflect.Method.invoke(Method.java:498)
      	at org.apache.tools.ant.dispatch.DispatchUtils.execute(DispatchUtils.java:106)
      	at org.apache.tools.ant.Task.perform(Task.java:348)
      	at org.apache.tools.ant.Target.execute(Target.java:435)
      	at org.apache.tools.ant.Target.performTasks(Target.java:456)
      	at org.apache.tools.ant.Project.executeSortedTargets(Project.java:1393)
      	at org.apache.tools.ant.Project.executeTarget(Project.java:1364)
      	at org.apache.tools.ant.helper.DefaultExecutor.executeTargets(DefaultExecutor.java:41)
      	at org.apache.tools.ant.Project.executeTargets(Project.java:1248)
      	at org.apache.tools.ant.module.bridge.impl.BridgeImpl.run(BridgeImpl.java:286)
      	at org.apache.tools.ant.module.run.TargetExecutor.run(TargetExecutor.java:555)
      	at org.netbeans.core.execution.RunClassThread.run(RunClassThread.java:153)
      Caused by: java.io.IOException: CreateProcess error=2, The system cannot find the file specified
      	at java.lang.ProcessImpl.create(Native Method)
      	at java.lang.ProcessImpl.<init>(ProcessImpl.java:386)
      	at java.lang.ProcessImpl.start(ProcessImpl.java:137)
      	at java.lang.ProcessBuilder.start(ProcessBuilder.java:1029)
      	... 23 more
      BUILD FAILED (total time: 0 seconds)
      

        Attachments

          Activity

            People

            • Assignee:
              jcesarmobile jcesarmobile
              Reporter:
              coudysk@gmail.com Radoslav Chovan
            • Votes:
              0 Vote for this issue
              Watchers:
              2 Start watching this issue

              Dates

              • Created:
                Updated:
                Resolved: