Uploaded image for project: 'Camel'
  1. Camel
  2. CAMEL-15451

camel-aws2-s3 - Test errors running local tests

    XMLWordPrintableJSON

    Details

    • Type: Test
    • Status: Resolved
    • Priority: Major
    • Resolution: Fixed
    • Affects Version/s: 3.5.0
    • Fix Version/s: 3.5.0
    • Component/s: tests
    • Labels:
      None
    • Estimated Complexity:
      Unknown

      Description

      [INFO]
      [INFO] Results:
      [INFO]
      [ERROR] Errors:
      [ERROR] org.apache.camel.component.aws2.s3.S3ComponentConfigurationTest.createEndpointWithCredentialsAndClientExistInRegistry
      [ERROR] Run 1: S3ComponentConfigurationTest.createEndpointWithCredentialsAndClientExistInRegistry:42 » SdkClient
      [ERROR] Run 2: S3ComponentConfigurationTest.createEndpointWithCredentialsAndClientExistInRegistry:42 » SdkClient
      [ERROR] Run 3: S3ComponentConfigurationTest.createEndpointWithCredentialsAndClientExistInRegistry:42 » SdkClient
      [INFO]
      [ERROR] org.apache.camel.component.aws2.s3.S3ComponentConfigurationTest.createEndpointWithCredentialsAndClientExistInRegistryWithAutodiscover
      [ERROR] Run 1: S3ComponentConfigurationTest.createEndpointWithCredentialsAndClientExistInRegistryWithAutodiscover:54 » SdkClient
      [ERROR] Run 2: S3ComponentConfigurationTest.createEndpointWithCredentialsAndClientExistInRegistryWithAutodiscover:54 » SdkClient
      [ERROR] Run 3: S3ComponentConfigurationTest.createEndpointWithCredentialsAndClientExistInRegistryWithAutodiscover:54 » SdkClient
      [INFO]
      [INFO]
      [ERROR] Tests run: 9, Failures: 0, Errors: 2, Skipped: 0

        Attachments

          Activity

            People

            • Assignee:
              acosentino Andrea Cosentino
              Reporter:
              davsclaus Claus Ibsen
            • Votes:
              0 Vote for this issue
              Watchers:
              2 Start watching this issue

              Dates

              • Created:
                Updated:
                Resolved: