Uploaded image for project: 'Bigtop'
  1. Bigtop
  2. BIGTOP-3303

Fix build failure of hbase-1.5.0 on Ubuntu

    XMLWordPrintableJSON

    Details

    • Type: Bug
    • Status: Resolved
    • Priority: Major
    • Resolution: Fixed
    • Affects Version/s: None
    • Fix Version/s: 1.5.0
    • Component/s: hbase
    • Labels:
      None

      Description

      [ERROR] Failed to execute goal org.apache.maven.plugins:maven-compiler-plugin:3.6.1:testCompile (default-testCompile) on project hbase-server: Compilation failure: Compilation failure: 
      [ERROR] /home/ubuntu/bigtop/output/hbase/hbase-1.5.0/hbase-server/src/test/java/org/apache/hadoop/hbase/security/token/TestGenerateDelegationToken.java:[20,1] cannot find symbol
      [ERROR]   symbol:   static containsString
      [ERROR]   location: class
      [ERROR] /home/ubuntu/bigtop/output/hbase/hbase-1.5.0/hbase-server/src/test/java/org/apache/hadoop/hbase/security/token/TestGenerateDelegationToken.java:[106,11] cannot find symbol
      [ERROR]   symbol:   method containsString(java.lang.String)
      [ERROR]   location: class org.apache.hadoop.hbase.security.token.TestGenerateDelegationToken
      

        Attachments

          Issue Links

            Activity

              People

              • Assignee:
                iwasakims Masatake Iwasaki
                Reporter:
                iwasakims Masatake Iwasaki
              • Votes:
                0 Vote for this issue
                Watchers:
                1 Start watching this issue

                Dates

                • Created:
                  Updated:
                  Resolved:

                  Time Tracking

                  Estimated:
                  Original Estimate - Not Specified
                  Not Specified
                  Remaining:
                  Remaining Estimate - 0h
                  0h
                  Logged:
                  Time Spent - 1h 20m
                  1h 20m