Uploaded image for project: 'Bigtop'
  1. Bigtop
  2. BIGTOP-3162 Define Bigtop 1.4.0 release BOM
  3. BIGTOP-3191

Old Gradle version causes Kafka 2.1.1 build failed

    XMLWordPrintableJSON

    Details

    • Type: Sub-task
    • Status: Resolved
    • Priority: Major
    • Resolution: Fixed
    • Affects Version/s: 1.3.0
    • Fix Version/s: 1.4.0
    • Component/s: build
    • Labels:
      None

      Description

      * What went wrong:
      A problem occurred evaluating root project 'kafka-2.1.1-src'.
      > Could not find method annotationProcessor() for arguments [org.openjdk.jmh:jmh-generator-annprocess:1.21] on object of type org.gradle.api.internal.artifacts.dsl.dependencies.DefaultDependencyHandler.
      
      * Try:
      Run with --stacktrace option to get the stack trace. Run with --info or --debug option to get more log output.
      
      BUILD FAILED in 52s
      
      error: Bad exit status from /var/tmp/rpm-tmp.gxsHho (%build)
          Bad exit status from /var/tmp/rpm-tmp.gxsHho (%build)
      
      RPM build errors:
      
      > Task :kafka-rpm FAILED
      :kafka-rpm (Thread[Task worker for ':' Thread 2,5,main]) completed. Took 55.286 secs.
      
      FAILURE: Build failed with an exception.
      
      * Where:
      Script '/bigtop/packages.gradle' line: 500
      
      * What went wrong:
      Execution failed for task ':kafka-rpm'.
      > Process 'command 'rpmbuild'' finished with non-zero exit value 1
      
      * Try:
      Run with --stacktrace option to get the stack trace. Run with --debug option to get more log output. Run with --scan to get full insights.
      
      * Get more help at 11 actionable tasks: 11 executed
      VCS Checkout Cache (/bigtop/.gradle/vcs-1) removing files not accessed on or after Thu Mar 07 21:42:36 UTC 2019.
      VCS Checkout Cache (/bigtop/.gradle/vcs-1) cleaned up in 0.01 secs.
      https://help.gradle.org
      
      BUILD FAILED in 1m 58s
      

        Attachments

          Issue Links

            Activity

              People

              • Assignee:
                evans_ye Evans Ye
                Reporter:
                evans_ye Evans Ye
              • Votes:
                0 Vote for this issue
                Watchers:
                1 Start watching this issue

                Dates

                • Created:
                  Updated:
                  Resolved:

                  Time Tracking

                  Estimated:
                  Original Estimate - Not Specified
                  Not Specified
                  Remaining:
                  Remaining Estimate - 0h
                  0h
                  Logged:
                  Time Spent - 10m
                  10m