XMLWordPrintableJSON

    Details

    • Type: Sub-task
    • Status: Resolved
    • Priority: Critical
    • Resolution: Fixed
    • Affects Version/s: 1.3.0
    • Fix Version/s: 1.4.0
    • Component/s: build
    • Labels:
      None

      Description

      Since yesterday we start to get connection refused by www-us.apache.org. The site seems still working but becoming very unstable.

      jenkins@bigtop-docker-slave-arm4:~/evans/bigtop$ ./gradlew realclean kafka-pkg-ind
      Starting a Gradle Daemon (subsequent builds will be faster)
      :alluxio_vardefines
      :alluxio-clean
      :ambari_vardefines
      :ambari-clean
      :apex_vardefines
      :apex-clean
      :bigtop-groovy_vardefines
      :bigtop-groovy-clean
      :bigtop-jsvc_vardefines
      :bigtop-jsvc-clean
      :bigtop-tomcat_vardefines
      :bigtop-tomcat-clean
      :bigtop-utils_vardefines
      :bigtop-utils-clean
      :clean UP-TO-DATE
      :crunch_vardefines
      :crunch-clean
      :flink_vardefines
      :flink-clean
      :flume_vardefines
      :flume-clean
      :giraph_vardefines
      :giraph-clean
      :gpdb_vardefines
      :gpdb-clean
      :hadoop_vardefines
      :hadoop-clean
      :hama_vardefines FAILED
      
      FAILURE: Build failed with an exception.
      
      * Where:
      Script '/home/jenkins/evans/bigtop/packages.gradle' line: 64
      
      * What went wrong:
      Execution failed for task ':hama_vardefines'.
      > java.net.SocketException: Connection reset
      
      * Try:
      Run with --stacktrace option to get the stack trace. Run with --info or --debug option to get more log output.
      
      * Get more help at https://help.gradle.org
      
      BUILD FAILED in 5m 35s
      28 actionable tasks: 27 executed, 1 up-to-date
      

      And

      > Task :hadoop_vardefines
      Putting task artifact state for task ':hadoop_vardefines' into context took 0.0 secs.
      Up-to-date check for task ':hadoop_vardefines' took 0.0 secs. It is not up-to-date because:
        Task has not declared any outputs.
      https://www-us.apache.org/dist//hadoop/common/hadoop-2.8.4/hadoop-2.8.4-src.tar.gz
      
      :hadoop_vardefines (Thread[Task worker for ':',5,main]) completed. Took 2 mins 9.48 secs.
      
      FAILURE: Build failed with an exception.
      
      * Where:
      Script '/home/jenkins/bigtop/packages.gradle' line: 65
      
      * What went wrong:
      Execution failed for task ':hadoop_vardefines'.
      > java.net.ConnectException: Connection timed out (Connection timed out)
      
      * Try:
      Run with --stacktrace option to get the stack trace. Run with --debug option to get more log output.
      
      * Get more help at https://help.gradle.org
      
      BUILD FAILED in 3m 44s
      26 actionable tasks: 25 executed, 1 up-to-date
      

      And

      :oozie_vardefines FAILED
      
      FAILURE: Build failed with an exception.
      
      * Where:
      Script '/home/jenkins/workspace/Bigtop-trunk-packages-BIGTOP-2993/COMPONENTS/bigtop-jsvc/OS/debian-9-aarch64/packages.gradle' line: 64
      
      * What went wrong:
      Execution failed for task ':oozie_vardefines'.
      > java.net.ConnectException: Connection refused (Connection refused)
      
      * Try:
      Run with --stacktrace option to get the stack trace. Run with --info or --debug option to get more log output.
      
      * Get more help at https://help.gradle.org
      
      BUILD FAILED in 58s
      40 actionable tasks: 39 executed, 1 up-to-date
      

        Attachments

          Activity

            People

            • Assignee:
              evans_ye Evans Ye
              Reporter:
              evans_ye Evans Ye
            • Votes:
              0 Vote for this issue
              Watchers:
              1 Start watching this issue

              Dates

              • Created:
                Updated:
                Resolved: