Uploaded image for project: 'Bigtop'
  1. Bigtop
  2. BIGTOP-2829

[iTest] build failed during Maven integration test phase

    Details

    • Type: Bug
    • Status: Resolved
    • Priority: Blocker
    • Resolution: Fixed
    • Affects Version/s: 1.2.0
    • Fix Version/s: 1.2.1, 1.3.0
    • Component/s: tests
    • Labels:
      None

      Description

      Try mvn deploy -f bigtop-test-framework/pom.xml

      [INFO] ------------------------------------------------------------------------
      [INFO] BUILD FAILURE
      [INFO] ------------------------------------------------------------------------
      [INFO] Total time: 28.748 s
      [INFO] Finished at: 2017-07-02T13:54:55+00:00
      [INFO] Final Memory: 19M/191M
      [INFO] ------------------------------------------------------------------------
      [ERROR] Failed to execute goal org.apache.maven.plugins:maven-failsafe-plugin:2.17:verify (default) on project itest-common: /tmp/bigtop-development/commit/bigtop/bigtop-test-framework/target/failsafe-reports/failsafe-summary.xml (No such file or directory) -> [Help 1]
      [ERROR]
      [ERROR] To see the full stack trace of the errors, re-run Maven with the -e switch.
      [ERROR] Re-run Maven using the -X switch to enable full debug logging.
      [ERROR]
      [ERROR] For more information about the errors and possible solutions, please read the following articles:
      [ERROR] [Help 1] http://cwiki.apache.org/confluence/display/MAVEN/MojoExecutionException
      

        Attachments

          Issue Links

            Activity

              People

              • Assignee:
                evans_ye Evans Ye
                Reporter:
                evans_ye Evans Ye
              • Votes:
                0 Vote for this issue
                Watchers:
                3 Start watching this issue

                Dates

                • Created:
                  Updated:
                  Resolved: