Uploaded image for project: 'Bigtop'
  1. Bigtop
  2. BIGTOP-2813

Bump up gradle-download-task version to 3.2.0

    XMLWordPrintableJSON

    Details

    • Type: Improvement
    • Status: Resolved
    • Priority: Major
    • Resolution: Duplicate
    • Affects Version/s: 1.2.0
    • Fix Version/s: None
    • Component/s: build
    • Labels:
      None

      Description

      I got an error like following in ssl proxy with a private cert:

      FAILURE: Build failed with an exception.
      
      * Where:
      Build file '/bigtop/build.gradle' line: 26
      
      * What went wrong:
      Error resolving plugin [id: 'de.undercouch.download', version: '2.0.0']
      > Could not GET 'https://plugins.gradle.org/api/gradle/2.12/plugin/use/de.undercouch.download/2.0.0'.
         > sun.security.validator.ValidatorException: PKIX path building failed: sun.security.provider.certpath.SunCertPathBuilderException: unable to find valid certification path to requested target
      

      Workaround for that is upgrading the download plugin to 3.2.0

        Attachments

          Issue Links

            Activity

              People

              • Assignee:
                Unassigned
                Reporter:
                warwithin YoungWoo Kim
              • Votes:
                0 Vote for this issue
                Watchers:
                3 Start watching this issue

                Dates

                • Created:
                  Updated:
                  Resolved: