Details

    • Type: Bug Bug
    • Status: Resolved
    • Priority: Trivial Trivial
    • Resolution: Fixed
    • Affects Version/s: 0.7.0
    • Fix Version/s: 0.8.0
    • Component/s: build
    • Labels:
      None

      Description

      $ gradle hive-rpm
      
      ......
      
      :hive_vardefines
      :hive-download FAILED
      
      FAILURE: Build failed with an exception.
      
      * Where:
      Script '/home/vagrant/bigtop/packages.gradle' line: 88
      
      * What went wrong:
      Execution failed for task ':hive-download'.
      > Could not download file
      
      * Try:
      Run with --stacktrace option to get the stack trace. Run with --info or --debug option to get more log output.
      
      BUILD FAILED
      
      

      In bigtop.mk,

      HIVE_TARBALL_SRC=${HIVE_TARBALL_DST}
      

      should be

      HIVE_TARBALL_SRC=$(HIVE_TARBALL_DST)
      

        Activity

        Hide
        Konstantin Boudnik added a comment -

        Indeed. Actually, it will be breaking any rpm creation as bigtop.mk is common across the two.

        +1 - will commit it in a minute.

        Show
        Konstantin Boudnik added a comment - Indeed. Actually, it will be breaking any rpm creation as bigtop.mk is common across the two. +1 - will commit it in a minute.
        Hide
        Konstantin Boudnik added a comment -

        Committed to the master. Thanks YoungWoo!

        Show
        Konstantin Boudnik added a comment - Committed to the master. Thanks YoungWoo!

          People

          • Assignee:
            YoungWoo Kim
            Reporter:
            YoungWoo Kim
          • Votes:
            0 Vote for this issue
            Watchers:
            2 Start watching this issue

            Dates

            • Created:
              Updated:
              Resolved:

              Development