Uploaded image for project: 'Apache Arrow'
  1. Apache Arrow
  2. ARROW-856

CmakeError by Unknown compiler.

    XMLWordPrintableJSON

    Details

    • Type: Bug
    • Status: Resolved
    • Priority: Major
    • Resolution: Fixed
    • Affects Version/s: None
    • Fix Version/s: 0.4.0
    • Component/s: C++, Python
    • Labels:
      None

      Description

      From :https://github.com/ray-project/ray/issues/468

      [root@SZV1000268092 python]# LANG=C gcc -v
      Using built-in specs.
      COLLECT_GCC=gcc
      COLLECT_LTO_WRAPPER=/usr/libexec/gcc/x86_64-redhat-linux/4.8.5/lto-wrapper
      Target: x86_64-redhat-linux
      Configured with: ../configure -prefix=/usr --mandir=/usr/share/man --infodir=/usr/share/info --with-bugurl=http://bugzilla.redhat.com/bugzilla --enable-bootstrap --enable-shared --enable-threads=posix --enable-checking=release --with-system-zlib --enable__cxa_atexit --disable-libunwind-exceptions --enable-gnu-unique-object --enable-linker-build-id --with-linker-hash-style=gnu --enable-languages=c,c+,objc,obj-c+,java,fortran,ada,go,lto --enable-plugin --enable-initfini-array --disable-libgcj --with-isl=/builddir/build/BUILD/gcc-4.8.5-20150702/obj-x86_64-redhat-linux/isl-install --with-cloog=/builddir/build/BUILD/gcc-4.8.5-20150702/obj-x86_64-redhat-linux/cloog-install --enable-gnu-indirect-function --with-tune=generic --with-arch_32=x86-64 --build=x86_64-redhat-linux
      Thread model: posix
      gcc version 4.8.5 20150623 (Red Hat 4.8.5-11) (GCC)

      Result:
      INFO GNU
      CMake Error at cmake_modules/CompilerInfo.cmake:62 (message):
      Unknown compiler. Version info is just the above.

      Error
      /usr/bin/c++ -g -O3 -march=native -mtune=native -DCXX_SUPPORTS_ALTIVEC -maltivec -o CMakeFiles/cmTryCompileExec1115247767.dir/src.cxx.o -c /home/dl/yangjie/ray/src/numbuf/thirdparty/arrow/cpp/build/CMakeFiles/CMakeTmp/src.cxx
      c++: error: unrecognized command line option '-maltivec'
      make[1]: *** [CMakeFiles/cmTryCompileExec1115247767.dir/src.cxx.o] Error 1
      make[1]: Leaving directory `/home/dl/yangjie/ray/src/numbuf/thirdparty/arrow/cpp/build/CMakeFiles/CMakeTmp'
      make: *** [cmTryCompileExec1115247767/fast] Error 2

        Attachments

          Activity

            People

            • Assignee:
              uwe Uwe L. Korn
              Reporter:
              coldsheep YJ
            • Votes:
              0 Vote for this issue
              Watchers:
              3 Start watching this issue

              Dates

              • Created:
                Updated:
                Resolved: