Uploaded image for project: 'Apache Arrow'
  1. Apache Arrow
  2. ARROW-5296

[Java] Sporadic Flight test failures

    XMLWordPrintableJSON

    Details

      Description

      Some of the timeout based tests may fail when CI is a bit loaded, for example:
      https://travis-ci.org/apache/arrow/jobs/530352133#L4377

      [ERROR] timeoutFires(org.apache.arrow.flight.TestCallOptions)  Time elapsed: 1.025 s  <<< FAILURE!
      java.lang.AssertionError: DEADLINE_EXCEEDED
      	at org.apache.arrow.flight.TestCallOptions.lambda$timeoutFires$0(TestCallOptions.java:44)
      	at org.apache.arrow.flight.TestCallOptions.test(TestCallOptions.java:70)
      	at org.apache.arrow.flight.TestCallOptions.timeoutFires(TestCallOptions.java:37)
      

        Attachments

          Issue Links

            Activity

              People

              • Assignee:
                lidavidm lidavidm
                Reporter:
                pitrou Antoine Pitrou
              • Votes:
                0 Vote for this issue
                Watchers:
                3 Start watching this issue

                Dates

                • Created:
                  Updated:
                  Resolved:

                  Time Tracking

                  Estimated:
                  Original Estimate - Not Specified
                  Not Specified
                  Remaining:
                  Remaining Estimate - 0h
                  0h
                  Logged:
                  Time Spent - 50m
                  50m