Uploaded image for project: 'Accumulo'
  1. Accumulo
  2. ACCUMULO-4602

Assorted flakey ITs that appear to be timeout sensitive

    Details

    • Type: Bug
    • Status: Resolved
    • Priority: Minor
    • Resolution: Fixed
    • Affects Version/s: 1.7.3
    • Fix Version/s: 1.7.4, 1.9.0, 2.0.0
    • Component/s: test
    • Labels:
      None

      Description

      Tests run: 1, Failures: 1, Errors: 0, Skipped: 0, Time elapsed: 48.387 sec <<< FAILURE! - in org.apache.accumulo.test.AssignmentThreadsIT
      testConcurrentAssignmentPerformance(org.apache.accumulo.test.AssignmentThreadsIT)  Time elapsed: 48.266 sec  <<< FAILURE!
      java.lang.AssertionError
      	at org.apache.accumulo.test.AssignmentThreadsIT.testConcurrentAssignmentPerformance(AssignmentThreadsIT.java:91)
      Tests run: 1, Failures: 0, Errors: 1, Skipped: 0, Time elapsed: 60.177 sec <<< FAILURE! - in org.apache.accumulo.test.BadDeleteMarkersCreatedIT
      test(org.apache.accumulo.test.BadDeleteMarkersCreatedIT)  Time elapsed: 60.011 sec  <<< ERROR!
      org.junit.runners.model.TestTimedOutException: test timed out after 60 seconds
      

      Both of these appear to just be sensitive to timings, and, as such, should not be tests.

        Attachments

          Activity

            People

            • Assignee:
              Unassigned
              Reporter:
              elserj Josh Elser
            • Votes:
              0 Vote for this issue
              Watchers:
              4 Start watching this issue

              Dates

              • Created:
                Updated:
                Resolved:

                Time Tracking

                Estimated:
                Original Estimate - Not Specified
                Not Specified
                Remaining:
                Remaining Estimate - 0h
                0h
                Logged:
                Time Spent - 1.5h
                1.5h