Uploaded image for project: 'Accumulo'
  1. Accumulo
  2. ACCUMULO-4372

CompressionTest unit test failure "SNAPPY created too many codecs expected"

    XMLWordPrintableJSON

    Details

    • Type: Bug
    • Status: Resolved
    • Priority: Major
    • Resolution: Fixed
    • Affects Version/s: 1.7.3, 1.8.0
    • Fix Version/s: 1.6.6, 1.7.3, 1.8.0
    • Component/s: test
    • Labels:

      Description

      https://secure.penguinsinabox.com/jenkins/job/Accumulo-Test-Master/1179/consoleFull

      Tests run: 5, Failures: 1, Errors: 0, Skipped: 0, Time elapsed: 0.662 sec <<< FAILURE! - in org.apache.accumulo.core.file.rfile.bcfile.CompressionTest
      testThereCanBeOnlyOne(org.apache.accumulo.core.file.rfile.bcfile.CompressionTest)  Time elapsed: 0.042 sec  <<< FAILURE!
      java.lang.AssertionError: SNAPPY created too many codecs expected:<1> but was:<2>
      	at org.apache.accumulo.core.file.rfile.bcfile.CompressionTest.testThereCanBeOnlyOne(CompressionTest.java:230)
      

      Marc Parisi, was this a new test brought in via ACCUMULO-4153? Mind taking a look?

        Attachments

        1. ACCUMULO-4372
          2 kB
          Marc Parisi

          Issue Links

            Activity

              People

              • Assignee:
                phrocker Marc Parisi
                Reporter:
                elserj Josh Elser
              • Votes:
                0 Vote for this issue
                Watchers:
                2 Start watching this issue

                Dates

                • Created:
                  Updated:
                  Resolved:

                  Time Tracking

                  Estimated:
                  Original Estimate - Not Specified
                  Not Specified
                  Remaining:
                  Remaining Estimate - 0h
                  0h
                  Logged:
                  Time Spent - 1h
                  1h