Bulk Operation

  1. Choose Issues
  2. Choose Operation
  3. Operation Details
  4. Confirmation

Step 1 of 4: Choose Issues

Cancel

T Patch Info Key Summary Assignee Reporter P Status Resolution Created Updated Due Development
Sub-task KAFKA-7539

KAFKA-2054 [deleted] ConsumerBounceTest.testClose transient failure

Unassigned John Roesler Major Closed Invalid  
Sub-task KAFKA-6118

KAFKA-2054 Transient failure in kafka.api.SaslScramSslEndToEndAuthorizationTest.testTwoConsumersWithDifferentSaslCredentials

Jason Gustafson Guozhang Wang Major Resolved Fixed  
Sub-task KAFKA-5955

KAFKA-2054 Transient failure: AuthorizerIntegrationTest.testTransactionalProducerTopicAuthorizationExceptionInCommit

Unassigned Ismael Juma Major Open Unresolved  
Sub-task KAFKA-5492

KAFKA-2054 LogRecoveryTest.testHWCheckpointWithFailuresSingleLogSegment transient failure

Unassigned Jason Gustafson Major Open Unresolved  
Sub-task KAFKA-5264

KAFKA-2054 kafka.api.SslProducerSendTest.testSendToPartition transient failure

Unassigned Xavier Léauté Major Open Unresolved  
Sub-task KAFKA-5227

KAFKA-2054 SaslScramSslEndToEndAuthorizationTest.testNoConsumeWithoutDescribeAclViaSubscribe

Rajini Sivaram Xavier Léauté Major Resolved Fixed  
Sub-task KAFKA-5209

KAFKA-2054 Transient failure: kafka.server.MetadataRequestTest.testControllerId

Unassigned Guozhang Wang Major Open Unresolved  
Sub-task KAFKA-5208

KAFKA-2054 Transient failure: kafka.api.SaslScramSslEndToEndAuthorizationTest.testNoConsumeWithDescribeAclViaSubscribe

Unassigned Guozhang Wang Major Resolved Duplicate  
Sub-task KAFKA-5184

KAFKA-2054 Transient failure: MultipleListenersWithAdditionalJaasContextTest.testProduceConsume

Balint Molnar Xavier Léauté Major Resolved Fixed  
Sub-task KAFKA-5183

KAFKA-2054 Transient failure: ReassignPartitionsClusterTest.shouldChangeThrottleOnRerunAndRemoveOnVerify

Unassigned Xavier Léauté Major Open Unresolved  
Sub-task KAFKA-5182

KAFKA-2054 Transient failure: RequestQuotaTest.testResponseThrottleTime

Rajini Sivaram Xavier Léauté Major Resolved Fixed  
Sub-task KAFKA-5180

KAFKA-2054 Transient failure: ControllerIntegrationTest.testControllerMoveIncrementsControllerEpoch

Onur Karaman Ismael Juma Major Resolved Fixed  
Sub-task KAFKA-5175

KAFKA-2054 Transient failure: ControllerIntegrationTest.testPreferredReplicaLeaderElection

Onur Karaman Ismael Juma Major Resolved Fixed  
Sub-task KAFKA-5124

KAFKA-2054 shouldInnerLeftJoin unit test fails

Armin Braun Eno Thereska Major Resolved Fixed  
Sub-task KAFKA-4973

KAFKA-2054 Transient failure of AdminClientTest.testDeleteRecordsWithException

Dong Lin Ismael Juma Major Resolved Fixed  
Sub-task KAFKA-4948

KAFKA-2054 Failure in kafka.admin.DescribeConsumerGroupTest.testDescribeExistingGroupWithNoMembersWithNewConsumer

Rajini Sivaram Guozhang Wang Major Resolved Fixed  
Sub-task KAFKA-4859

KAFKA-2054 Transient test failure: org.apache.kafka.streams.integration.JoinIntegrationTest.shouldCountClicksPerRegion (again)

Armin Braun Armin Braun Major Resolved Fixed  
Sub-task KAFKA-4833

KAFKA-2054 Transient unit test failure in AbstractCoordinatorTest

Unassigned Jiangjie Qin Major Resolved Invalid  
Sub-task KAFKA-4801

KAFKA-2054 Transient test failure (part 2): ConsumerBounceTest.testConsumptionWithBrokerFailures

Unassigned Armin Braun Minor In Progress Unresolved  
Sub-task KAFKA-4786

KAFKA-2054 Transient test failure: ConsumerCoordinatorTest.testHeartbeatThreadClose

Rajini Sivaram Ismael Juma Major Resolved Fixed  
Sub-task KAFKA-4692

KAFKA-2054 Transient test failure in org.apache.kafka.streams.integration.KStreamAggregationDedupIntegrationTest

Unassigned Guozhang Wang Major Resolved Cannot Reproduce  
Sub-task KAFKA-4588

KAFKA-2054 QueryableStateIntegrationTest.shouldNotMakeStoreAvailableUntilAllStoresAvailable is occasionally failing on jenkins

Damian Guy Damian Guy Major Resolved Fixed  
Sub-task KAFKA-4583

KAFKA-2054 KafkaConsumerTest.testGracefulClose transient failure

Rajini Sivaram Ismael Juma Major Reopened Unresolved  
Sub-task KAFKA-4569

KAFKA-2054 Transient failure in org.apache.kafka.clients.consumer.KafkaConsumerTest.testWakeupWithFetchDataAvailable

Umesh Chaudhary Guozhang Wang Major Resolved Fixed  
Sub-task KAFKA-4550

KAFKA-2054 current trunk unstable

Unassigned radai rosenblatt Major Resolved Duplicate  
Sub-task KAFKA-4528

KAFKA-2054 Failure in kafka.producer.ProducerTest.testAsyncSendCanCorrectlyFailWithTimeout

Ismael Juma Guozhang Wang Major Resolved Fixed  
Sub-task KAFKA-4352

KAFKA-2054 Failure in org.apache.kafka.streams.integration.ResetIntegrationTest.testReprocessingFromScratchAfterReset

Matthias J. Sax Guozhang Wang Major Resolved Fixed  
Sub-task KAFKA-4332

KAFKA-2054 kafka.api.UserQuotaTest.testThrottledProducerConsumer transient unit test failure

Unassigned Jun Rao Critical Resolved Duplicate  
Sub-task KAFKA-4222

KAFKA-2054 Flaky Test QueryableStateIntegrationTest.queryOnRebalance

Guozhang Wang Jason Gustafson Major Resolved Fixed  
Sub-task KAFKA-4198

KAFKA-2054 Transient test failure: ConsumerBounceTest.testConsumptionWithBrokerFailures

Armin Braun Ismael Juma Major Resolved Fixed  
Sub-task KAFKA-4196

KAFKA-2054 Transient test failure: DeleteConsumerGroupTest.testConsumptionOnRecreatedTopicAfterTopicWideDeleteInZK

Unassigned Ismael Juma Major Resolved Auto Closed  
Sub-task KAFKA-4186

KAFKA-2054 Transient failure in KStreamAggregationIntegrationTest

Matthias J. Sax Jason Gustafson Major Resolved Cannot Reproduce  
Sub-task KAFKA-4147

KAFKA-2054 Transient failure in ConsumerCoordinatorTest.testAutoCommitDynamicAssignment

Jason Gustafson Jason Gustafson Major Resolved Fixed  
Sub-task KAFKA-4143

KAFKA-2054 Transient failure in kafka.server.SaslSslReplicaFetchTest.testReplicaFetcherThread

Unassigned Guozhang Wang Major Resolved Fixed  
Sub-task KAFKA-4075

KAFKA-2054 Failure in SaslSslTopicMetadataTest.testIsrAfterBrokerShutDownAndJoinsBack

Unassigned Guozhang Wang Major Resolved Duplicate  
Sub-task KAFKA-4058

KAFKA-2054 Failure in org.apache.kafka.streams.integration.ResetIntegrationTest.testReprocessingFromScratchAfterReset

Matthias J. Sax Guozhang Wang Major Resolved Fixed  
Sub-task KAFKA-4049

KAFKA-2054 Transient failure in RegexSourceIntegrationTest.testRegexMatchesTopicsAWhenDeleted

Guozhang Wang Guozhang Wang Major Resolved Fixed  
Sub-task KAFKA-4038

KAFKA-2054 Transient failure in DeleteTopicsRequestTest.testErrorDeleteTopicRequests

Grant Henke Jason Gustafson Major Resolved Fixed  
Sub-task KAFKA-3931

KAFKA-2054 kafka.api.PlaintextConsumerTest.testPatternUnsubscription transient failure

Vahid Hashemian Vahid Hashemian Major Resolved Fixed  
Sub-task KAFKA-3926

KAFKA-2054 Transient failures in org.apache.kafka.streams.integration.RegexSourceIntegrationTest

Bill Bejeck Guozhang Wang Major Resolved Fixed  
Sub-task KAFKA-3896

KAFKA-2054 Unstable test KStreamRepartitionJoinTest.shouldCorrectlyRepartitionOnJoinOperations

Guozhang Wang Ashish Singh Major Resolved Fixed  
Sub-task KAFKA-3884

KAFKA-2054 KGroupedStreamIntegrationTest.shouldAggregate seems to be hanging

Guozhang Wang Ismael Juma Major Resolved Duplicate  
Sub-task KAFKA-3882

KAFKA-2054 Integration failures on low-end machines

Guozhang Wang Guozhang Wang Major Resolved Not A Bug  
Sub-task KAFKA-3877

KAFKA-2054 Gradle compiler daemon exits with non-zero exit code while running LogOffsetTest

Unassigned Ismael Juma Major Open Unresolved  
Sub-task KAFKA-3876

KAFKA-2054 Transient test failure: kafka.api.PlaintextConsumerTest.testExpandingTopicSubscriptions

Unassigned Ismael Juma Major Open Unresolved  
Sub-task KAFKA-3875

KAFKA-2054 Transient test failure: kafka.api.SslProducerSendTest.testSendNonCompressedMessageWithCreateTime

Jun Rao Ismael Juma Major Resolved Fixed  
Sub-task KAFKA-3874

KAFKA-2054 Transient test failure: org.apache.kafka.streams.integration.JoinIntegrationTest.shouldCountClicksPerRegion

Damian Guy Ismael Juma Major Resolved Fixed  
Sub-task KAFKA-3873

KAFKA-2054 Gradle Test Executor non-zero exit code when running streams tests

Damian Guy Ismael Juma Major Resolved Duplicate  
Sub-task KAFKA-3872

KAFKA-2054 OOM while running Kafka Streams integration tests

Eno Thereska Ismael Juma Major Resolved Fixed  
Sub-task KAFKA-3871

KAFKA-2054 Transient test failure: SslConsumerTest.testSimpleConsumption

Unassigned Ismael Juma Major Open Unresolved  
Sub-task KAFKA-3865

KAFKA-2054 Transient failures in org.apache.kafka.connect.runtime.WorkerSourceTaskTest.testSlowTaskStart

Jason Gustafson Guozhang Wang Major Resolved Fixed  
Sub-task KAFKA-3678

KAFKA-2054 Fix stream integration test timeouts

Eno Thereska Eno Thereska Major Resolved Fixed  
Sub-task KAFKA-3662

KAFKA-2054 Failure in kafka.network.SocketServerTest.tooBigRequestIsRejecte

Rajini Sivaram Guozhang Wang Major Resolved Fixed  
Sub-task KAFKA-3626

KAFKA-2054 Transient failure in testGetAllTopicMetadata

Liquan Pei Jason Gustafson Major Open Unresolved  
Sub-task KAFKA-3529

KAFKA-2054 Transient kafka.api.PlaintextConsumerTest.testAsyncCommit failures

Jason Gustafson Ismael Juma Major Resolved Fixed  
Sub-task KAFKA-3508

KAFKA-2054 Transient failure in kafka.security.auth.SimpleAclAuthorizerTest.testHighConcurrencyModificationOfResourceAcls

Unassigned Guozhang Wang Major Resolved Fixed  
Sub-task KAFKA-3502

KAFKA-2054 Build is killed during kafka streams tests due to `pure virtual method called` error

Unassigned Ashish Singh Major Resolved Cannot Reproduce  
Sub-task KAFKA-3498

KAFKA-2054 Transient failure in kafka.api.SslConsumerTest.testSimpleConsumption

Unassigned Guozhang Wang Major Resolved Duplicate  
Sub-task KAFKA-3484

KAFKA-2054 Transient failure in SslConsumerTest.testListTopics

Unassigned Jason Gustafson Major Resolved Not A Problem  
Sub-task KAFKA-3420

KAFKA-2054 Transient failure in OffsetCommitTest.testNonExistingTopicOffsetCommit

Unassigned Jason Gustafson Major Open Unresolved  
Sub-task KAFKA-3290

KAFKA-2054 WorkerSourceTask testCommit transient failure

Ewen Cheslack-Postava Jason Gustafson Major Resolved Fixed  
Sub-task KAFKA-3246

KAFKA-2054 Transient Failure in kafka.producer.SyncProducerTest.testProduceCorrectlyReceivesResponse

Unassigned Guozhang Wang Critical Reopened Unresolved  
Sub-task KAFKA-3222

KAFKA-2054 SslProducerSendTest transient failure.

Unassigned Jiangjie Qin Major Resolved Duplicate  
Sub-task KAFKA-3220

KAFKA-2054 Failure in kafka.server.ClientQuotaManagerTest.testQuotaViolation

Unassigned Guozhang Wang Major Resolved Fixed  
Sub-task KAFKA-3182

KAFKA-2054 Failure in kafka.network.SocketServerTest.testSocketsCloseOnShutdown

Armin Braun Guozhang Wang Major Resolved Fixed  
Sub-task KAFKA-3168

KAFKA-2054 Failure in kafka.integration.PrimitiveApiTest.testPipelinedProduceRequests

Unassigned Guozhang Wang Major Resolved Fixed  
Sub-task KAFKA-3155

KAFKA-2054 Transient Failure in kafka.api.PlaintextProducerSendTest.testFlush

Armin Braun Guozhang Wang Major Resolved Fixed  
Sub-task KAFKA-3117

KAFKA-2054 Fail test at: PlaintextConsumerTest. testAutoCommitOnRebalance

Jason Gustafson edwardt Major Resolved Resolved  
Sub-task KAFKA-3103

KAFKA-2054 Transient Failure in kafka.integration.PlaintextTopicMetadataTest.testIsrAfterBrokerShutDownAndJoinsBack

Denise Fernandez Guozhang Wang Major Resolved Fixed  
Sub-task KAFKA-3063

KAFKA-2054 LogRecoveryTest exits with -1 occasionally

Ismael Juma Guozhang Wang Major Resolved Fixed  
Sub-task KAFKA-3035

KAFKA-2054 Transient: kafka.api.PlaintextConsumerTest > testAutoOffsetReset FAILED

Liquan Pei Gwen Shapira Major Resolved Fixed  
Sub-task KAFKA-3034

KAFKA-2054 kafka.api.PlaintextConsumerTest > testSeek FAILED

Unassigned Gwen Shapira Major Resolved Fixed  
Sub-task KAFKA-3001

KAFKA-2054 Transient Failure in kafka.api.SaslPlaintextConsumerTest

Unassigned Guozhang Wang Major Resolved Duplicate  
Sub-task KAFKA-2994

KAFKA-2054 Transient Failure due to BindException: Address already in use

Unassigned Guozhang Wang Major Resolved Duplicate  
Sub-task KAFKA-2977

KAFKA-2054 Transient Failure in kafka.log.LogCleanerIntegrationTest.cleanerTest

Jin Xing Guozhang Wang Major Resolved Fixed  
Sub-task KAFKA-2943

KAFKA-2054 Transient Failure in kafka.producer.SyncProducerTest.testReachableServer

Unassigned Guozhang Wang Major Resolved Auto Closed  
Sub-task KAFKA-2933

KAFKA-2054 Failure in kafka.api.PlaintextConsumerTest.testMultiConsumerDefaultAssignment

Jason Gustafson Guozhang Wang Critical Reopened Unresolved  
Sub-task KAFKA-2910

KAFKA-2054 Failure in kafka.api.SslEndToEndAuthorizationTest.testNoGroupAcl

Rajini Sivaram Guozhang Wang Major Resolved Fixed  
Sub-task KAFKA-2873

KAFKA-2054 o.a.k.connect.util.KafkaBasedLogTest failure in 0.9 RC4

Unassigned Jiangjie Qin Major Resolved Duplicate  
Sub-task KAFKA-2853

KAFKA-2054 Reuse of temporary server data.dir could lead to transient failures.

Unassigned Guozhang Wang Major Resolved Duplicate  
Sub-task KAFKA-2839

KAFKA-2054 Kafka connect log test failing

Jin Xing Gwen Shapira Major Resolved Duplicate  
Sub-task KAFKA-2837

KAFKA-2054 FAILING TEST: kafka.api.ProducerBounceTest > testBrokerFailure

Jin Xing Gwen Shapira Major Resolved Fixed  
Sub-task KAFKA-2836

KAFKA-2054 FAILING TEST: SaslSslTopicMetadataTest

Bill Bejeck Gwen Shapira Blocker Resolved Duplicate  
Sub-task KAFKA-2835

KAFKA-2054 FAILING TEST: LogCleaner

Jin Xing Gwen Shapira Major Resolved Duplicate  
Sub-task KAFKA-2718

KAFKA-2054 Reuse of temporary directories leading to transient unit test failures

Rajini Sivaram Rajini Sivaram Major Resolved Fixed  
Sub-task KAFKA-2667

KAFKA-2054 Copycat KafkaBasedLogTest.testSendAndReadToEnd transient failure

Ewen Cheslack-Postava Jason Gustafson Major Resolved Fixed  
Sub-task KAFKA-2613

KAFKA-2054 Consider capping `maxParallelForks` for Jenkins builds

Ewen Cheslack-Postava Ismael Juma Major Resolved Fixed  
Sub-task KAFKA-2587

KAFKA-2054 Transient test failure: `SimpleAclAuthorizerTest`

Parth Brahmbhatt Ismael Juma Major Resolved Fixed  
Sub-task KAFKA-2558

KAFKA-2054 ServerShutdownTest is failing intermittently

Flavio Paiva Junqueira Flavio Paiva Junqueira Major Resolved Fixed  
Sub-task KAFKA-2455

KAFKA-2054 Test Failure: kafka.consumer.MetricsTest > testMetricsLeak

Jin Xing Gwen Shapira Major Resolved Fixed  
Sub-task KAFKA-2442

KAFKA-2054 QuotasTest should not fail when cpu is busy

Aditya Auradkar Dong Lin Major Resolved Won't Fix  
Sub-task KAFKA-2415

KAFKA-2054 Transient failure in LogRecoveryTest.testHWCheckpointWithFailuresMultipleLogSegments

Jiangjie Qin Jiangjie Qin Major Resolved Fixed  
Sub-task KAFKA-2401

KAFKA-2054 Fix transient failure of ProducerSendTest.testCloseWithZeroTimeoutFromSenderThread()

Jiangjie Qin Jiangjie Qin Major Resolved Fixed  
Sub-task KAFKA-2398

KAFKA-2054 Transient test failure for SocketServerTest - Socket closed.

Ewen Cheslack-Postava Jiangjie Qin Major Resolved Fixed  
Sub-task KAFKA-2386

KAFKA-2054 Transient test failure: testGenerationIdIncrementsOnRebalance

Jason Gustafson Jason Gustafson Major Resolved Fixed  
Sub-task KAFKA-2363

KAFKA-2054 ProducerSendTest.testCloseWithZeroTimeoutFromCallerThread Transient Failure

Armin Braun Fangmin Lv Major Resolved Fixed  
Sub-task KAFKA-2342

KAFKA-2054 KafkaConsumer rebalance with in-flight fetch can cause invalid position

Jason Gustafson Jun Rao Major Resolved Fixed  
Sub-task KAFKA-2271

KAFKA-2054 transient unit test failure in KafkaConfigConfigDefTest.testFromPropsToProps

Jason Gustafson Jun Rao Major Resolved Fixed  
Sub-task KAFKA-2103

KAFKA-2054 kafka.producer.AsyncProducerTest failure.

Ewen Cheslack-Postava Jiangjie Qin Major Resolved Fixed  
Sub-task KAFKA-2089

KAFKA-2054 MetadataTest transient failure

Rajini Sivaram Jun Rao Major Resolved Fixed  
Sub-task KAFKA-2086

KAFKA-2054 testRoundRobinPartitionAssignor transient failure

Unassigned Jun Rao Major Closed Duplicate  
Sub-task KAFKA-2081

KAFKA-2054 testUncleanLeaderElectionEnabledByTopicOverride transient failure

Parag Shah Jun Rao Major Resolved Cannot Reproduce  
Sub-task KAFKA-2059

KAFKA-2054 ZookeeperConsumerConnectorTest.testBasic transient failure

Unassigned Guozhang Wang Major Resolved Cannot Reproduce  
Sub-task KAFKA-2058

KAFKA-2054 ProducerTest.testSendWithDeadBroker transient failure

Jin Xing Guozhang Wang Major Resolved Fixed  
Sub-task KAFKA-2057

KAFKA-2054 DelayedOperationTest.testRequestExpiry transient failure

Rajini Sivaram Guozhang Wang Major Resolved Fixed  
Sub-task KAFKA-2056

KAFKA-2054 PartitionAssignorTest.testRangePartitionAssignor transient failure

Fangmin Lv Guozhang Wang Major Resolved Fixed  
Sub-task KAFKA-2055

KAFKA-2054 ConsumerBounceTest.testSeekAndCommitWithBrokerFailures transient failure

Fangmin Lv Guozhang Wang Major Resolved Fixed  
Sub-task KAFKA-1573

KAFKA-2054 Transient test failures on LogTest.testCorruptLog

Parag Shah Guozhang Wang Major Resolved Not A Problem  
Sub-task KAFKA-435

KAFKA-2054 Keep track of the transient test failure for Kafka-343 on Apache Jenkins

Yang Ye Yang Ye Minor Resolved Cannot Reproduce  

Cancel