Uploaded image for project: 'ZooKeeper'
  1. ZooKeeper
  2. ZOOKEEPER-4216

Flaky test: WatcherCleanerTest.testDeadWatcherMetrics

    XMLWordPrintableJSON

Details

    • Bug
    • Status: Open
    • Minor
    • Resolution: Unresolved
    • None
    • None
    • tests
    • None

    Description

      [INFO] Running org.apache.zookeeper.server.watch.WatchManagerTest
      [INFO] Running org.apache.zookeeper.server.watch.WatchManagerTest[INFO] Tests run: 2, Failures: 0, Errors: 0, Skipped: 0, Time elapsed: 16.836 s - in org.apache.zookeeper.server.PrepRequestProcessorMetricsTest
      [INFO] Running org.apache.zookeeper.server.ZooKeeperServerCreationTest
      
      [ERROR] Tests run: 4, Failures: 1, Errors: 0, Skipped: 0, Time elapsed: 5.26 s <<< FAILURE! - in org.apache.zookeeper.server.watch.WatcherCleanerTest[ERROR] testDeadWatcherMetrics  Time elapsed: 0.142 s  <<< FAILURE!org.opentest4j.AssertionFailedError: expected: <20.0> but was: <27.3333> at org.apache.zookeeper.server.watch.WatcherCleanerTest.testDeadWatcherMetrics(WatcherCleanerTest.java:166)
      
      [INFO] Running org.apache.zookeeper.server.InvalidSnapshotTest[INFO] Tests run: 1, Failures: 0, Errors: 0, Skipped: 0, Time elapsed: 5.196 s - in org.apache.zookeeper.server.ZooKeeperServerCreationTest[INFO] Tests run: 8, Failures: 0,
      

      Attachments

        Activity

          People

            Unassigned Unassigned
            maoling Ling Mao
            Votes:
            0 Vote for this issue
            Watchers:
            2 Start watching this issue

            Dates

              Created:
              Updated: