Uploaded image for project: 'ZooKeeper'
  1. ZooKeeper
  2. ZOOKEEPER-4015

Flaky test: RequestPathMetricsCollectorTest.testMultiThreadPerf

    XMLWordPrintableJSON

Details

    • Bug
    • Status: Open
    • Minor
    • Resolution: Unresolved
    • None
    • None
    • None
    • None

    Description

      [2020-11-22T07:40:12.646Z] [ERROR] Failures: 
      [2020-11-22T07:40:12.646Z] [ERROR]   RequestPathMetricsCollectorTest.testMultiThreadPerf:448 expected: <true> but was: <false>
      [2020-11-22T07:40:12.646Z] [INFO] 
      [2020-11-22T07:40:12.646Z] [ERROR] Tests run: 2880, Failures: 1, Errors: 0, Skipped: 4
      [2020-11-22T07:40:12.646Z] [INFO] 
      [2020-11-22T07:40:14.238Z] [INFO] -----------------------------------------------------------------------
      
      

      URL: https://ci-hadoop.apache.org/blue/organizations/jenkins/zookeeper-precommit-github-pr/detail/PR-1527/2/pipeline

      Attachments

        Activity

          People

            Unassigned Unassigned
            maoling Ling Mao
            Votes:
            0 Vote for this issue
            Watchers:
            1 Start watching this issue

            Dates

              Created:
              Updated: