Uploaded image for project: 'Zeppelin'
  1. Zeppelin
  2. ZEPPELIN-1981 [Umbrella] Fix all flaky tests
  3. ZEPPELIN-3854

Flaky test - org.apache.zeppelin.scheduler.RemoteSchedulerTest.testAbortOnPending

    XMLWordPrintableJSON

    Details

    • Type: Sub-task
    • Status: Open
    • Priority: Major
    • Resolution: Unresolved
    • Affects Version/s: None
    • Fix Version/s: None
    • Component/s: None
    • Labels:
      None

      Description

      https://api.travis-ci.org/v3/job/446566408/log.txt

      Tests run: 2, Failures: 1, Errors: 0, Skipped: 0, Time elapsed: 12.265 sec <<< FAILURE! - in org.apache.zeppelin.scheduler.RemoteSchedulerTest
      testAbortOnPending(org.apache.zeppelin.scheduler.RemoteSchedulerTest)  Time elapsed: 7.019 sec  <<< FAILURE!
      java.lang.AssertionError: null
      	at org.junit.Assert.fail(Assert.java:86)
      	at org.junit.Assert.assertTrue(Assert.java:41)
      	at org.junit.Assert.assertTrue(Assert.java:52)
      	at org.apache.zeppelin.scheduler.RemoteSchedulerTest.testAbortOnPending(RemoteSchedulerTest.java:258)
      

        Attachments

          Activity

            People

            • Assignee:
              lijubjohn Liju
              Reporter:
              moon Lee Moon Soo
            • Votes:
              0 Vote for this issue
              Watchers:
              2 Start watching this issue

              Dates

              • Created:
                Updated: