Uploaded image for project: 'Zeppelin'
  1. Zeppelin
  2. ZEPPELIN-3233

Snapshot 0.9.0 snapshot built from source failed on ubuntu

    XMLWordPrintableJSON

    Details

    • Type: Bug
    • Status: Open
    • Priority: Minor
    • Resolution: Unresolved
    • Affects Version/s: 0.9.0
    • Fix Version/s: None
    • Component/s: build
    • Labels:
      None
    • Environment:

      ubuntu 14.04

      java 7

      Description

      ...

      [INFO] Zeppelin: Scio ..................................... SUCCESS [ 58.435 s]

      [INFO] Zeppelin: Neo4j interpreter ........................ SUCCESS [ 58.558 s]

      [INFO] Zeppelin: web Application .......................... FAILURE [01:14 min]

      [INFO] Zeppelin: Server ................................... SKIPPED

      [INFO] Zeppelin: Jupyter Support .......................... SKIPPED

      [INFO] Zeppelin: Packaging distribution ................... SKIPPED

      [INFO] Zeppelin: R Interpreter ............................ SKIPPED

      [INFO] ------------------------------------------------------------------------

      [INFO] BUILD FAILURE

      [INFO] ------------------------------------------------------------------------

      [INFO] Total time: 13:48 min

      [INFO] Finished at: 2018-02-12T06:40:42-08:00

      [INFO] Final Memory: 299M/952M

      [INFO] ------------------------------------------------------------------------

      [WARNING] The requested profile "hadoop-2.7" could not be activated because it does not exist.

      [WARNING] The requested profile "sparkr" could not be activated because it does not exist.

      [ERROR] Failed to execute goal com.github.eirslett:frontend-maven-plugin:1.3:npm (npm install) on project zeppelin-web: Failed to run task: 'npm install --no-lockfile' failed. (error code 1) -> [Help 1]

      [ERROR]

      [ERROR] To see the full stack trace of the errors, re-run Maven with the -e switch.

      [ERROR] Re-run Maven using the -X switch to enable full debug logging.

      [ERROR]

      [ERROR] For more information about the errors and possible solutions, please read the following articles:

      [ERROR] [Help 1] http://cwiki.apache.org/confluence/display/MAVEN/MojoFailureException

      [ERROR]

      [ERROR] After correcting the problems, you can resume the build with the command

      [ERROR]   mvn <goals> -rf :zeppelin-web

       

      (Similar to ZEPPELIN-2877. Tried all methods found on web but all are not successful)

        Attachments

          Activity

            People

            • Assignee:
              Unassigned
              Reporter:
              UELCS_64 Eric Chiu
            • Votes:
              0 Vote for this issue
              Watchers:
              1 Start watching this issue

              Dates

              • Created:
                Updated: