Uploaded image for project: 'Zeppelin'
  1. Zeppelin
  2. ZEPPELIN-2877

Apache Zeppelin 0.8 SNAPSHOT build from source failed on Ubuntu

    Details

    • Type: Bug
    • Status: Closed
    • Priority: Minor
    • Resolution: Workaround
    • Affects Version/s: 0.8.0
    • Fix Version/s: None
    • Component/s: Core
    • Labels:
    • Environment:

      OS - Ubuntu
      JDK - OpenJDK 7

      Description

      [INFO] Zeppelin: Server ................................... FAILURE [ 16.743 s]

      [INFO] Zeppelin: Jupyter Support .......................... SKIPPED

      [INFO] Zeppelin: Packaging distribution ................... SKIPPED

      [INFO]

      [INFO] BUILD FAILURE

      [INFO]

      [INFO] Total time: 26.483 s

      [INFO] Finished at: 2017-08-23T05:20:34-07:00

      [INFO] Final Memory: 68M/341M

      [ERROR] Failed to execute goal org.apache.maven.plugins:maven-compiler-plugin:3.1:compile (default-compile) on project zeppelin-server: Compilation failure: Compilation failure: [ERROR] /home/apache/zeppelin/zeppelin-server/src/main/java/org/apache/zeppelin/server/CorsFilter.java:[86,76] cannot find symbol

      [ERROR] symbol: method getStrictTransport()

      [ERROR] location: variable zeppelinConfiguration of type org.apache.zeppelin.conf.ZeppelinConfiguration

      [ERROR] /home/apache/zeppelin/zeppelin-server/src/main/java/org/apache/zeppelin/server/CorsFilter.java:[88,65] cannot find symbol

      [ERROR] symbol: method getXxssProtection() [ERROR] location: variable zeppelinConfiguration of type org.apache.zeppelin.conf.ZeppelinConfiguration

      [ERROR] -> [Help 1]

      [ERROR]

      [ERROR] To see the full stack trace of the errors, re-run Maven with the -e switch.

      [ERROR] Re-run Maven using the -X switch to enable full debug logging.

      [ERROR]

      [ERROR] For more information about the errors and possible solutions, please read the following articles:

      [ERROR] [Help 1] http://cwiki.apache.org/confluence/display/MAVEN/MojoFailureException

      [ERROR]

      [ERROR] After correcting the problems, you can resume the build with the command

      [ERROR] mvn -rf :zeppelin-server

        Attachments

          Activity

            People

            • Assignee:
              Unassigned
              Reporter:
              sabirajan Robin Sabi Rajan
            • Votes:
              0 Vote for this issue
              Watchers:
              4 Start watching this issue

              Dates

              • Created:
                Updated:
                Resolved: