Uploaded image for project: 'Zeppelin'
  1. Zeppelin
  2. ZEPPELIN-1981 [Umbrella] Fix all flaky tests
  3. ZEPPELIN-2732

Flaky test - testSingleDynamicFormSelectForm

Agile BoardAttach filesAttach ScreenshotAdd voteVotersWatch issueWatchersLinkCloneUpdate Comment AuthorReplace String in CommentUpdate Comment VisibilityDelete Comments
    XMLWordPrintableJSON

Details

    • Sub-task
    • Status: Open
    • Major
    • Resolution: Unresolved
    • None
    • None
    • None
    • None

    Description

      Flaky test

      log - https://api.travis-ci.org/jobs/250622951/log.txt?deansi=true

      Tests run: 15, Failures: 1, Errors: 0, Skipped: 0, Time elapsed: 342.77 sec <<< FAILURE! - in org.apache.zeppelin.integration.ParagraphActionsIT
      testSingleDynamicFormSelectForm(org.apache.zeppelin.integration.ParagraphActionsIT)  Time elapsed: 16.79 sec  <<< FAILURE!
      java.lang.AssertionError: After 'Run on selection change' checkbox is unchecked, the paragraph should not run if selecting a different option
      Expected: "Howdy 1"
           but: was "Howdy 2"
      	at org.hamcrest.MatcherAssert.assertThat(MatcherAssert.java:20)
      	at org.junit.Assert.assertThat(Assert.java:956)
      	at org.junit.rules.ErrorCollector$1.call(ErrorCollector.java:65)
      	at org.junit.rules.ErrorCollector.checkSucceeds(ErrorCollector.java:78)
      	at org.junit.rules.ErrorCollector.checkThat(ErrorCollector.java:63)
      	at org.apache.zeppelin.integration.ParagraphActionsIT.testSingleDynamicFormSelectForm(ParagraphActionsIT.java:634)
      

      Attachments

        Activity

          This comment will be Viewable by All Users Viewable by All Users
          Cancel

          People

            Unassigned Unassigned
            moon Lee Moon Soo

            Dates

              Created:
              Updated:

              Slack

                Issue deployment