Uploaded image for project: 'Zeppelin'
  1. Zeppelin
  2. ZEPPELIN-2471

NotebookTest fails on travis

    XMLWordPrintableJSON

    Details

    • Type: Bug
    • Status: Resolved
    • Priority: Minor
    • Resolution: Fixed
    • Affects Version/s: None
    • Fix Version/s: 0.8.0
    • Component/s: None
    • Labels:

      Description

      NotebookTest fails with the message "NotebookTest.testReloadAllNotes:195 expected:<1> but was:<2>"

      Log - https://travis-ci.org/AlexanderShoshin/zeppelin/jobs/226729540

      Running org.apache.zeppelin.notebook.NotebookTest
      SLF4J: Class path contains multiple SLF4J bindings.
      SLF4J: Found binding in [jar:file:/home/travis/build/AlexanderShoshin/zeppelin/zeppelin-interpreter/target/lib/slf4j-log4j12-1.7.10.jar!/org/slf4j/impl/StaticLoggerBinder.class]
      SLF4J: Found binding in [jar:file:/home/travis/.m2/repository/org/slf4j/slf4j-log4j12/1.7.10/slf4j-log4j12-1.7.10.jar!/org/slf4j/impl/StaticLoggerBinder.class]
      SLF4J: See http://www.slf4j.org/codes.html#multiple_bindings for an explanation.
      SLF4J: Actual binding is of type [org.slf4j.impl.Log4jLoggerFactory]
      09:54:59,926  INFO org.apache.zeppelin.conf.ZeppelinConfiguration:104 - Load configuration from file:/home/travis/build/AlexanderShoshin/zeppelin/zeppelin-zengine/target/test-classes/zeppelin-site.xml
      09:54:59,997  INFO org.apache.zeppelin.conf.ZeppelinConfiguration:112 - Server Host: 0.0.0.0
      09:54:59,997  INFO org.apache.zeppelin.conf.ZeppelinConfiguration:114 - Server Port: 8080
      09:54:59,997  INFO org.apache.zeppelin.conf.ZeppelinConfiguration:118 - Context Path: /
      09:55:00,003  INFO org.apache.zeppelin.conf.ZeppelinConfiguration:119 - Zeppelin Version: 0.8.0-SNAPSHOT
      09:55:00,406  INFO org.apache.zeppelin.interpreter.InterpreterFactory:131 - shiroEnabled: false
      09:55:00,650  INFO org.apache.commons.vfs2.impl.StandardFileSystemManager:138 - Using "/tmp/vfs_cache" as temporary files store.
      09:55:00,716  INFO org.apache.zeppelin.notebook.NotebookAuthorization:96 - /tmp/ZeppelinLTest_1493373299898/conf/notebook-authorization.json
      09:55:00,717  INFO org.apache.zeppelin.user.Credentials:102 - /tmp/ZeppelinLTest_1493373299898/conf/credentials.json
      09:55:00,787  INFO org.apache.zeppelin.notebook.Notebook:127 - Notebook indexing started...
      09:55:00,803  INFO org.apache.zeppelin.notebook.Notebook:129 - Notebook indexing finished: 0 indexed in 0s
      09:55:00,846  INFO org.apache.zeppelin.interpreter.InterpreterFactory:189 - Create interpreter instance mock1 for note 2CDWBETB9
      09:55:00,846  INFO org.apache.zeppelin.interpreter.InterpreterFactory:229 - Create repl org.apache.zeppelin.interpreter.mock.MockInterpreter1 from mock1
      09:55:00,848  INFO org.apache.zeppelin.interpreter.InterpreterFactory:222 - Interpreter org.apache.zeppelin.interpreter.mock.MockInterpreter1 721931922 created
      09:55:00,852  INFO org.apache.zeppelin.notebook.Paragraph:367 - run paragraph 20170428-095500_577555379 using null org.apache.zeppelin.interpreter.LazyOpenInterpreter@2b07ce92
      09:55:00,866  INFO org.apache.zeppelin.interpreter.InterpreterGroup:185 - Close interpreter group 2CETYK23T:shared_process for session: 2CDWBETB9
      09:55:00,868  INFO org.apache.zeppelin.interpreter.InterpreterGroup:185 - Close interpreter group 2CFF8KF2G:shared_process for session: 2CDWBETB9
      09:55:00,885  INFO org.apache.zeppelin.interpreter.InterpreterFactory:189 - Create interpreter instance mock1 for note 2CH5HSPSK
      09:55:00,885  INFO org.apache.zeppelin.interpreter.InterpreterFactory:229 - Create repl org.apache.zeppelin.interpreter.mock.MockInterpreter1 from mock1
      09:55:00,885  INFO org.apache.zeppelin.interpreter.InterpreterFactory:222 - Interpreter org.apache.zeppelin.interpreter.mock.MockInterpreter1 752646990 created
      09:55:00,886  INFO org.apache.zeppelin.notebook.Paragraph:367 - run paragraph 20170428-095500_811223572 using null org.apache.zeppelin.interpreter.LazyOpenInterpreter@2cdc7b4e
      09:55:00,887  INFO org.apache.zeppelin.interpreter.InterpreterGroup:185 - Close interpreter group 2CETYK23T:shared_process for session: 2CH5HSPSK
      09:55:00,887  INFO org.apache.zeppelin.interpreter.InterpreterGroup:185 - Close interpreter group 2CFF8KF2G:shared_process for session: 2CH5HSPSK
      09:55:00,903  INFO org.apache.zeppelin.interpreter.InterpreterFactory:131 - shiroEnabled: false
      09:55:00,908  INFO org.apache.zeppelin.user.Credentials:102 - /tmp/ZeppelinLTest_1493373300893/conf/credentials.json
      09:55:00,910  INFO org.apache.zeppelin.notebook.Notebook:127 - Notebook indexing started...
      09:55:00,910  INFO org.apache.zeppelin.notebook.Notebook:129 - Notebook indexing finished: 0 indexed in 0s
      09:55:00,919  INFO org.apache.zeppelin.interpreter.InterpreterFactory:189 - Create interpreter instance mock1 for note 2CE5NHYQQ
      09:55:00,919  INFO org.apache.zeppelin.interpreter.InterpreterFactory:229 - Create repl org.apache.zeppelin.interpreter.mock.MockInterpreter1 from mock1
      09:55:00,920  INFO org.apache.zeppelin.interpreter.InterpreterFactory:222 - Interpreter org.apache.zeppelin.interpreter.mock.MockInterpreter1 1498571495 created
      09:55:00,921  INFO org.apache.zeppelin.notebook.Paragraph:367 - run paragraph 20170428-095500_5028279 using null org.apache.zeppelin.interpreter.LazyOpenInterpreter@595262e7
      09:55:00,922  INFO org.apache.zeppelin.interpreter.InterpreterFactory:189 - Create interpreter instance mock2 for note 2CE5NHYQQ
      09:55:00,922  INFO org.apache.zeppelin.interpreter.InterpreterFactory:229 - Create repl org.apache.zeppelin.interpreter.mock.MockInterpreter2 from mock2
      09:55:00,923  INFO org.apache.zeppelin.interpreter.InterpreterFactory:222 - Interpreter org.apache.zeppelin.interpreter.mock.MockInterpreter2 936142845 created
      09:55:00,924  INFO org.apache.zeppelin.notebook.Paragraph:367 - run paragraph 20170428-095500_1417572099 using mock2 org.apache.zeppelin.interpreter.LazyOpenInterpreter@37cc67fd
      09:55:00,925 ERROR org.apache.zeppelin.notebook.NotebookAuthorization:156 - Error saving notebook authorization file: No such file or directory
      09:55:00,934  INFO org.apache.zeppelin.interpreter.InterpreterFactory:131 - shiroEnabled: false
      09:55:00,938  INFO org.apache.zeppelin.user.Credentials:102 - /tmp/ZeppelinLTest_1493373300926/conf/credentials.json
      09:55:00,940  INFO org.apache.zeppelin.notebook.Notebook:127 - Notebook indexing started...
      09:55:00,940  INFO org.apache.zeppelin.notebook.Notebook:129 - Notebook indexing finished: 0 indexed in 0s
      09:55:00,949  INFO org.apache.zeppelin.interpreter.InterpreterFactory:189 - Create interpreter instance mock1 for note 2CG376111
      09:55:00,949  INFO org.apache.zeppelin.interpreter.InterpreterFactory:229 - Create repl org.apache.zeppelin.interpreter.mock.MockInterpreter1 from mock1
      09:55:00,949  INFO org.apache.zeppelin.interpreter.InterpreterFactory:222 - Interpreter org.apache.zeppelin.interpreter.mock.MockInterpreter1 852103486 created
      09:55:00,950  INFO org.apache.zeppelin.notebook.Paragraph:367 - run paragraph 20170428-095500_2117051920 using null org.apache.zeppelin.interpreter.LazyOpenInterpreter@32ca113e
      09:55:01,954  INFO org.apache.zeppelin.interpreter.InterpreterSettingManager:966 - Job paragraph_1493373300948_-1031212639 aborted 
      09:55:01,955  INFO org.apache.zeppelin.interpreter.InterpreterSettingManager:971 - Job paragraph_1493373300949_-1031597388 aborted 
      09:55:01,955  INFO org.apache.zeppelin.interpreter.InterpreterGroup:185 - Close interpreter group 2CFTRJ24M:shared_process for session: shared_session
      09:55:01,956  INFO org.apache.zeppelin.interpreter.InterpreterFactory:189 - Create interpreter instance mock1 for note 2CG376111
      09:55:01,956 ERROR org.apache.zeppelin.notebook.NotebookAuthorization:156 - Error saving notebook authorization file: No such file or directory
      09:55:01,956  INFO org.apache.zeppelin.interpreter.InterpreterFactory:229 - Create repl org.apache.zeppelin.interpreter.mock.MockInterpreter1 from mock1
      09:55:01,957  INFO org.apache.zeppelin.interpreter.InterpreterFactory:222 - Interpreter org.apache.zeppelin.interpreter.mock.MockInterpreter1 1690701110 created
      09:55:01,957  INFO org.apache.zeppelin.notebook.Paragraph:367 - run paragraph 20170428-095500_1782555944 using null org.apache.zeppelin.interpreter.LazyOpenInterpreter@64c60d36
      09:55:01,958 ERROR org.apache.zeppelin.scheduler.Job:183 - Job failed
      java.lang.NullPointerException
      	at org.apache.zeppelin.notebook.Paragraph.jobRun(Paragraph.java:373)
      	at org.apache.zeppelin.scheduler.Job.run(Job.java:181)
      	at org.apache.zeppelin.scheduler.FIFOScheduler$1.run(FIFOScheduler.java:139)
      	at java.util.concurrent.Executors$RunnableAdapter.call(Executors.java:471)
      	at java.util.concurrent.FutureTask.run(FutureTask.java:262)
      	at java.util.concurrent.ScheduledThreadPoolExecutor$ScheduledFutureTask.access$201(ScheduledThreadPoolExecutor.java:178)
      	at java.util.concurrent.ScheduledThreadPoolExecutor$ScheduledFutureTask.run(ScheduledThreadPoolExecutor.java:292)
      	at java.util.concurrent.ThreadPoolExecutor.runWorker(ThreadPoolExecutor.java:1145)
      	at java.util.concurrent.ThreadPoolExecutor$Worker.run(ThreadPoolExecutor.java:615)
      	at java.lang.Thread.run(Thread.java:745)
      09:55:01,966  INFO org.apache.zeppelin.interpreter.InterpreterFactory:131 - shiroEnabled: false
      09:55:01,970  INFO org.apache.zeppelin.user.Credentials:102 - /tmp/ZeppelinLTest_1493373301958/conf/credentials.json
      09:55:01,974  INFO org.apache.zeppelin.notebook.Notebook:127 - Notebook indexing started...
      09:55:01,974  INFO org.apache.zeppelin.notebook.Notebook:129 - Notebook indexing finished: 0 indexed in 0s
      09:55:01,982  INFO org.apache.zeppelin.interpreter.InterpreterFactory:189 - Create interpreter instance mock1 for note 2CHKS9SDB
      09:55:01,983  INFO org.apache.zeppelin.interpreter.InterpreterFactory:229 - Create repl org.apache.zeppelin.interpreter.mock.MockInterpreter1 from mock1
      09:55:01,983  INFO org.apache.zeppelin.interpreter.InterpreterFactory:222 - Interpreter org.apache.zeppelin.interpreter.mock.MockInterpreter1 966173463 created
      09:55:01,984  INFO org.apache.zeppelin.notebook.Paragraph:367 - run paragraph 20170428-095501_2241145 using null org.apache.zeppelin.interpreter.LazyOpenInterpreter@3996a317
      09:55:01,985  INFO org.apache.zeppelin.interpreter.InterpreterGroup:185 - Close interpreter group 2CEFA2ZBX:shared_process for session: 2CHKS9SDB
      09:55:01,986  INFO org.apache.zeppelin.interpreter.InterpreterGroup:185 - Close interpreter group 2CGEADSVS:shared_process for session: 2CHKS9SDB
      09:55:01,987  INFO org.apache.zeppelin.interpreter.InterpreterFactory:189 - Create interpreter instance mock1 for note 2CHKS9SDB
      09:55:01,987  INFO org.apache.zeppelin.interpreter.InterpreterFactory:229 - Create repl org.apache.zeppelin.interpreter.mock.MockInterpreter1 from mock1
      09:55:01,987  INFO org.apache.zeppelin.interpreter.InterpreterFactory:222 - Interpreter org.apache.zeppelin.interpreter.mock.MockInterpreter1 1783727829 created
      09:55:01,989  INFO org.apache.zeppelin.notebook.Paragraph:367 - run paragraph 20170428-095501_2241145 using null org.apache.zeppelin.interpreter.LazyOpenInterpreter@6a5186d5
      09:55:01,989  INFO org.apache.zeppelin.interpreter.InterpreterGroup:185 - Close interpreter group 2CEFA2ZBX:shared_process for session: 2CHKS9SDB
      09:55:01,990  INFO org.apache.zeppelin.interpreter.InterpreterGroup:185 - Close interpreter group 2CGEADSVS:shared_process for session: 2CHKS9SDB
      09:55:01,990 ERROR org.apache.zeppelin.notebook.NotebookAuthorization:156 - Error saving notebook authorization file: No such file or directory
      09:55:01,999  INFO org.apache.zeppelin.interpreter.InterpreterFactory:131 - shiroEnabled: false
      09:55:02,004  INFO org.apache.zeppelin.user.Credentials:102 - /tmp/ZeppelinLTest_1493373301992/conf/credentials.json
      09:55:02,005  INFO org.apache.zeppelin.notebook.Notebook:127 - Notebook indexing started...
      09:55:02,006  INFO org.apache.zeppelin.notebook.Notebook:129 - Notebook indexing finished: 0 indexed in 0s
      09:55:02,041 ERROR org.apache.zeppelin.notebook.NotebookAuthorization:156 - Error saving notebook authorization file: No such file or directory
      09:55:02,047 ERROR org.apache.zeppelin.notebook.NotebookAuthorization:156 - Error saving notebook authorization file: No such file or directory
      09:55:02,047 ERROR org.apache.zeppelin.notebook.NotebookAuthorization:156 - Error saving notebook authorization file: No such file or directory
      09:55:02,054  INFO org.apache.zeppelin.interpreter.InterpreterFactory:131 - shiroEnabled: false
      09:55:02,547  INFO org.apache.zeppelin.user.Credentials:102 - /tmp/ZeppelinLTest_1493373302048/conf/credentials.json
      09:55:02,548  INFO org.apache.zeppelin.notebook.Notebook:127 - Notebook indexing started...
      09:55:02,548  INFO org.apache.zeppelin.notebook.Notebook:129 - Notebook indexing finished: 0 indexed in 0s
      09:55:02,554 ERROR org.apache.zeppelin.notebook.NotebookAuthorization:156 - Error saving notebook authorization file: No such file or directory
      09:55:02,561 ERROR org.apache.zeppelin.notebook.NotebookAuthorization:156 - Error saving notebook authorization file: No such file or directory
      09:55:02,561 ERROR org.apache.zeppelin.notebook.NotebookAuthorization:156 - Error saving notebook authorization file: No such file or directory
      09:55:02,562 ERROR org.apache.zeppelin.notebook.NotebookAuthorization:156 - Error saving notebook authorization file: No such file or directory
      09:55:02,574  INFO org.apache.zeppelin.interpreter.InterpreterFactory:131 - shiroEnabled: false
      09:55:02,581  INFO org.apache.zeppelin.user.Credentials:102 - /tmp/ZeppelinLTest_1493373302568/conf/credentials.json
      09:55:02,582  INFO org.apache.zeppelin.notebook.Notebook:127 - Notebook indexing started...
      09:55:02,583  INFO org.apache.zeppelin.notebook.Notebook:129 - Notebook indexing finished: 0 indexed in 0s
      09:55:02,595  INFO org.apache.zeppelin.interpreter.InterpreterFactory:189 - Create interpreter instance mock1 for note 2CFNPMACQ
      09:55:02,595  INFO org.apache.zeppelin.interpreter.InterpreterFactory:229 - Create repl org.apache.zeppelin.interpreter.mock.MockInterpreter1 from mock1
      09:55:02,595  INFO org.apache.zeppelin.interpreter.InterpreterFactory:222 - Interpreter org.apache.zeppelin.interpreter.mock.MockInterpreter1 576799053 created
      09:55:02,597  INFO org.apache.zeppelin.notebook.Paragraph:367 - run paragraph 20170428-095502_36914915 using null org.apache.zeppelin.interpreter.LazyOpenInterpreter@2261414d
      09:55:02,597 ERROR org.apache.zeppelin.notebook.NotebookAuthorization:156 - Error saving notebook authorization file: No such file or directory
      09:55:02,605  INFO org.apache.zeppelin.interpreter.InterpreterFactory:131 - shiroEnabled: false
      09:55:02,615  INFO org.apache.zeppelin.user.Credentials:102 - /tmp/ZeppelinLTest_1493373302599/conf/credentials.json
      09:55:02,616  INFO org.apache.zeppelin.notebook.Notebook:127 - Notebook indexing started...
      09:55:02,616  INFO org.apache.zeppelin.notebook.Notebook:129 - Notebook indexing finished: 0 indexed in 0s
      09:55:02,633 ERROR org.apache.zeppelin.notebook.NotebookAuthorization:156 - Error saving notebook authorization file: No such file or directory
      09:55:02,650  INFO org.apache.zeppelin.interpreter.InterpreterFactory:131 - shiroEnabled: false
      09:55:02,653  INFO org.apache.zeppelin.user.Credentials:102 - /tmp/ZeppelinLTest_1493373302644/conf/credentials.json
      09:55:02,654  INFO org.apache.zeppelin.notebook.Notebook:127 - Notebook indexing started...
      09:55:02,655  INFO org.apache.zeppelin.notebook.Notebook:129 - Notebook indexing finished: 0 indexed in 0s
      09:55:02,671 ERROR org.apache.zeppelin.notebook.NotebookAuthorization:156 - Error saving notebook authorization file: No such file or directory
      09:55:02,671 ERROR org.apache.zeppelin.notebook.NotebookAuthorization:156 - Error saving notebook authorization file: No such file or directory
      09:55:02,672 ERROR org.apache.zeppelin.notebook.NotebookAuthorization:156 - Error saving notebook authorization file: No such file or directory
      09:55:02,672 ERROR org.apache.zeppelin.notebook.NotebookAuthorization:156 - Error saving notebook authorization file: No such file or directory
      09:55:02,673 ERROR org.apache.zeppelin.notebook.NotebookAuthorization:156 - Error saving notebook authorization file: No such file or directory
      09:55:02,673 ERROR org.apache.zeppelin.notebook.NotebookAuthorization:156 - Error saving notebook authorization file: No such file or directory
      09:55:02,674 ERROR org.apache.zeppelin.notebook.NotebookAuthorization:156 - Error saving notebook authorization file: No such file or directory
      09:55:02,675 ERROR org.apache.zeppelin.notebook.NotebookAuthorization:156 - Error saving notebook authorization file: No such file or directory
      09:55:02,683  INFO org.apache.zeppelin.interpreter.InterpreterFactory:131 - shiroEnabled: false
      09:55:02,695  INFO org.apache.zeppelin.user.Credentials:102 - /tmp/ZeppelinLTest_1493373302677/conf/credentials.json
      09:55:02,696  INFO org.apache.zeppelin.notebook.Notebook:127 - Notebook indexing started...
      09:55:02,696  INFO org.apache.zeppelin.notebook.Notebook:129 - Notebook indexing finished: 0 indexed in 0s
      09:55:02,715  INFO org.apache.zeppelin.interpreter.InterpreterFactory:131 - shiroEnabled: false
      09:55:02,771 ERROR org.apache.zeppelin.notebook.NotebookAuthorization:156 - Error saving notebook authorization file: No such file or directory
      09:55:02,778  INFO org.apache.zeppelin.interpreter.InterpreterFactory:131 - shiroEnabled: false
      09:55:02,782  INFO org.apache.zeppelin.user.Credentials:102 - /tmp/ZeppelinLTest_1493373302773/conf/credentials.json
      09:55:02,784  INFO org.apache.zeppelin.notebook.Notebook:127 - Notebook indexing started...
      09:55:02,784  INFO org.apache.zeppelin.notebook.Notebook:129 - Notebook indexing finished: 0 indexed in 0s
      09:55:02,792 ERROR org.apache.zeppelin.notebook.NotebookAuthorization:156 - Error saving notebook authorization file: No such file or directory
      09:55:02,799  INFO org.apache.zeppelin.interpreter.InterpreterFactory:131 - shiroEnabled: false
      09:55:02,803  INFO org.apache.zeppelin.user.Credentials:102 - /tmp/ZeppelinLTest_1493373302794/conf/credentials.json
      09:55:02,804  INFO org.apache.zeppelin.notebook.Notebook:127 - Notebook indexing started...
      09:55:02,805  INFO org.apache.zeppelin.notebook.Notebook:129 - Notebook indexing finished: 0 indexed in 0s
      09:55:02,806 ERROR org.apache.zeppelin.notebook.NotebookAuthorization:156 - Error saving notebook authorization file: No such file or directory
      09:55:02,811 ERROR org.apache.zeppelin.notebook.NotebookAuthorization:156 - Error saving notebook authorization file: No such file or directory
      09:55:02,833  INFO org.apache.zeppelin.interpreter.InterpreterFactory:131 - shiroEnabled: false
      09:55:02,837  INFO org.apache.zeppelin.user.Credentials:102 - /tmp/ZeppelinLTest_1493373302828/conf/credentials.json
      09:55:02,839  INFO org.apache.zeppelin.notebook.Notebook:127 - Notebook indexing started...
      09:55:02,840  INFO org.apache.zeppelin.notebook.Notebook:129 - Notebook indexing finished: 0 indexed in 0s
      09:55:02,875  INFO org.apache.zeppelin.notebook.FolderView:107 - Create folder /
      09:55:02,875  INFO org.apache.zeppelin.notebook.Folder:168 - Set parent of / to /
      09:55:02,875  INFO org.apache.zeppelin.notebook.Folder:184 - Add note 2A94M5J1Z to folder /
      09:55:02,882  INFO org.apache.zeppelin.interpreter.InterpreterFactory:131 - shiroEnabled: false
      09:55:02,886  INFO org.apache.zeppelin.user.Credentials:102 - /tmp/ZeppelinLTest_1493373302877/conf/credentials.json
      09:55:02,888  INFO org.apache.zeppelin.notebook.Notebook:127 - Notebook indexing started...
      09:55:02,888  INFO org.apache.zeppelin.notebook.Notebook:129 - Notebook indexing finished: 0 indexed in 0s
      09:55:02,901  INFO org.apache.zeppelin.notebook.FolderView:205 - Note name changed:  -> Note 2CFS9WS5J
      09:55:02,901  INFO org.apache.zeppelin.notebook.FolderView:107 - Create folder /
      09:55:02,901  INFO org.apache.zeppelin.notebook.Folder:168 - Set parent of / to /
      09:55:02,901  INFO org.apache.zeppelin.notebook.Folder:184 - Add note 2CFS9WS5J to folder /
      09:55:02,906 ERROR org.apache.zeppelin.notebook.NotebookAuthorization:156 - Error saving notebook authorization file: No such file or directory
      09:55:02,907  INFO org.apache.zeppelin.notebook.Folder:199 - Remove note 2CFS9WS5J from folder /
      09:55:02,907  INFO org.apache.zeppelin.notebook.FolderView:142 - Folder / is empty
      09:55:02,908  INFO org.apache.zeppelin.notebook.FolderView:129 - Remove folder /
      09:55:02,908  INFO org.apache.zeppelin.notebook.Folder:179 - Remove child / from /
      09:55:02,908 ERROR org.apache.zeppelin.notebook.NotebookAuthorization:156 - Error saving notebook authorization file: No such file or directory
      09:55:02,914  INFO org.apache.zeppelin.interpreter.InterpreterFactory:131 - shiroEnabled: false
      09:55:02,918  INFO org.apache.zeppelin.user.Credentials:102 - /tmp/ZeppelinLTest_1493373302910/conf/credentials.json
      09:55:02,919  INFO org.apache.zeppelin.notebook.Notebook:127 - Notebook indexing started...
      09:55:02,919  INFO org.apache.zeppelin.notebook.Notebook:129 - Notebook indexing finished: 0 indexed in 0s
      09:55:02,925  INFO org.apache.zeppelin.notebook.Note:613 - skip to run blank paragraph. 20170428-095502_1221369641
      09:55:04,925 ERROR org.apache.zeppelin.notebook.NotebookAuthorization:156 - Error saving notebook authorization file: No such file or directory
      09:55:04,942  INFO org.apache.zeppelin.interpreter.InterpreterFactory:131 - shiroEnabled: false
      09:55:04,946  INFO org.apache.zeppelin.user.Credentials:102 - /tmp/ZeppelinLTest_1493373304928/conf/credentials.json
      09:55:04,947  INFO org.apache.zeppelin.notebook.Notebook:127 - Notebook indexing started...
      09:55:04,947  INFO org.apache.zeppelin.notebook.Notebook:129 - Notebook indexing finished: 0 indexed in 0s
      09:55:05,005  INFO org.apache.zeppelin.interpreter.InterpreterFactory:189 - Create interpreter instance mock1 for note 2CEEWS1R7
      09:55:05,005  INFO org.apache.zeppelin.interpreter.InterpreterFactory:229 - Create repl org.apache.zeppelin.interpreter.mock.MockInterpreter1 from mock1
      09:55:05,005  INFO org.apache.zeppelin.interpreter.InterpreterFactory:222 - Interpreter org.apache.zeppelin.interpreter.mock.MockInterpreter1 1211033161 created
      09:55:05,005  INFO org.apache.zeppelin.interpreter.InterpreterFactory:189 - Create interpreter instance mock2 for note 2CEEWS1R7
      09:55:05,005  INFO org.apache.zeppelin.interpreter.InterpreterFactory:229 - Create repl org.apache.zeppelin.interpreter.mock.MockInterpreter2 from mock2
      09:55:05,006  INFO org.apache.zeppelin.interpreter.InterpreterFactory:222 - Interpreter org.apache.zeppelin.interpreter.mock.MockInterpreter2 1683449129 created
      09:55:05,018  INFO org.apache.zeppelin.notebook.Paragraph:367 - run paragraph 20170428-095504_964265644 using null org.apache.zeppelin.interpreter.LazyOpenInterpreter@482ee649
      09:55:05,018  INFO org.apache.zeppelin.notebook.Paragraph:367 - run paragraph 20170428-095504_1501078446 using mock2 org.apache.zeppelin.interpreter.LazyOpenInterpreter@64576529
      09:55:07,011  INFO org.apache.zeppelin.notebook.Paragraph:367 - run paragraph 20170428-095504_1501078446 using mock2 org.apache.zeppelin.interpreter.LazyOpenInterpreter@64576529
      09:55:07,017  INFO org.apache.zeppelin.notebook.Paragraph:367 - run paragraph 20170428-095504_964265644 using null org.apache.zeppelin.interpreter.LazyOpenInterpreter@482ee649
      09:55:08,019  INFO org.apache.zeppelin.interpreter.InterpreterGroup:185 - Close interpreter group 2CEX1H5UR:shared_process for session: shared_session
      09:55:08,031  INFO org.apache.zeppelin.interpreter.InterpreterGroup:185 - Close interpreter group 2CFJESDW6:shared_process for session: shared_session
      09:55:08,038 ERROR org.apache.zeppelin.notebook.NotebookAuthorization:156 - Error saving notebook authorization file: No such file or directory
      09:55:08,050  INFO org.apache.zeppelin.interpreter.InterpreterFactory:131 - shiroEnabled: false
      09:55:08,057  INFO org.apache.zeppelin.user.Credentials:102 - /tmp/ZeppelinLTest_1493373308042/conf/credentials.json
      09:55:08,060  INFO org.apache.zeppelin.notebook.Notebook:127 - Notebook indexing started...
      09:55:08,060  INFO org.apache.zeppelin.notebook.Notebook:129 - Notebook indexing finished: 0 indexed in 0s
      09:55:08,089  INFO org.apache.zeppelin.interpreter.InterpreterFactory:131 - shiroEnabled: false
      09:55:08,093  INFO org.apache.zeppelin.user.Credentials:102 - /tmp/ZeppelinLTest_1493373308083/conf/credentials.json
      09:55:08,095  INFO org.apache.zeppelin.notebook.Notebook:127 - Notebook indexing started...
      09:55:08,095  INFO org.apache.zeppelin.notebook.Notebook:129 - Notebook indexing finished: 0 indexed in 0s
      09:55:08,097 ERROR org.apache.zeppelin.notebook.NotebookAuthorization:156 - Error saving notebook authorization file: No such file or directory
      09:55:08,109  INFO org.apache.zeppelin.interpreter.InterpreterFactory:131 - shiroEnabled: false
      09:55:08,113  INFO org.apache.zeppelin.user.Credentials:102 - /tmp/ZeppelinLTest_1493373308103/conf/credentials.json
      09:55:08,117  INFO org.apache.zeppelin.notebook.Notebook:127 - Notebook indexing started...
      09:55:08,118  INFO org.apache.zeppelin.notebook.Notebook:129 - Notebook indexing finished: 0 indexed in 0s
      09:55:08,129  INFO org.apache.zeppelin.interpreter.InterpreterFactory:189 - Create interpreter instance mock1 for note 2CE3CMY5G
      09:55:08,130  INFO org.apache.zeppelin.interpreter.InterpreterFactory:229 - Create repl org.apache.zeppelin.interpreter.mock.MockInterpreter1 from mock1
      09:55:08,130  INFO org.apache.zeppelin.interpreter.InterpreterFactory:222 - Interpreter org.apache.zeppelin.interpreter.mock.MockInterpreter1 1946216862 created
      09:55:08,131  INFO org.apache.zeppelin.notebook.Paragraph:367 - run paragraph 20170428-095508_857845555 using null org.apache.zeppelin.interpreter.LazyOpenInterpreter@7400e99e
      09:55:09,002  INFO org.apache.zeppelin.notebook.Paragraph:367 - run paragraph 20170428-095508_857845555 using null org.apache.zeppelin.interpreter.LazyOpenInterpreter@7400e99e
      09:55:11,129 ERROR org.apache.zeppelin.notebook.NotebookAuthorization:156 - Error saving notebook authorization file: No such file or directory
      09:55:11,135  INFO org.apache.zeppelin.interpreter.InterpreterFactory:131 - shiroEnabled: false
      09:55:11,139  INFO org.apache.zeppelin.user.Credentials:102 - /tmp/ZeppelinLTest_1493373311131/conf/credentials.json
      09:55:11,141  INFO org.apache.zeppelin.notebook.Notebook:127 - Notebook indexing started...
      09:55:11,141  INFO org.apache.zeppelin.notebook.Notebook:129 - Notebook indexing finished: 0 indexed in 0s
      09:55:11,146  INFO org.apache.zeppelin.interpreter.InterpreterFactory:189 - Create interpreter instance mock1 for note 2CEBQC6RF
      09:55:11,147  INFO org.apache.zeppelin.interpreter.InterpreterFactory:229 - Create repl org.apache.zeppelin.interpreter.mock.MockInterpreter1 from mock1
      09:55:11,147  INFO org.apache.zeppelin.interpreter.InterpreterFactory:222 - Interpreter org.apache.zeppelin.interpreter.mock.MockInterpreter1 802928030 created
      09:55:11,148  INFO org.apache.zeppelin.notebook.Paragraph:367 - run paragraph 20170428-095511_1400401527 using null org.apache.zeppelin.interpreter.LazyOpenInterpreter@2fdbb59e
      09:55:11,153  INFO org.apache.zeppelin.notebook.FolderView:205 - Note name changed:  -> clone note
      09:55:11,154  INFO org.apache.zeppelin.notebook.FolderView:107 - Create folder /
      09:55:11,154  INFO org.apache.zeppelin.notebook.Folder:168 - Set parent of / to /
      09:55:11,154  INFO org.apache.zeppelin.notebook.Folder:184 - Add note 2CEWWVS29 to folder /
      09:55:11,161 ERROR org.apache.zeppelin.notebook.NotebookAuthorization:156 - Error saving notebook authorization file: No such file or directory
      09:55:11,164  INFO org.apache.zeppelin.notebook.FolderView:205 - Note name changed:  -> clone note2
      09:55:11,164  INFO org.apache.zeppelin.notebook.Folder:184 - Add note 2CHJSYWGC to folder /
      09:55:11,170 ERROR org.apache.zeppelin.notebook.NotebookAuthorization:156 - Error saving notebook authorization file: No such file or directory
      09:55:11,171  INFO org.apache.zeppelin.notebook.Folder:199 - Remove note 2CEWWVS29 from folder /
      09:55:11,172 ERROR org.apache.zeppelin.notebook.NotebookAuthorization:156 - Error saving notebook authorization file: No such file or directory
      09:55:11,173  INFO org.apache.zeppelin.notebook.Folder:199 - Remove note 2CHJSYWGC from folder /
      09:55:11,173  INFO org.apache.zeppelin.notebook.FolderView:142 - Folder / is empty
      09:55:11,173  INFO org.apache.zeppelin.notebook.FolderView:129 - Remove folder /
      09:55:11,173  INFO org.apache.zeppelin.notebook.Folder:179 - Remove child / from /
      09:55:11,174 ERROR org.apache.zeppelin.notebook.NotebookAuthorization:156 - Error saving notebook authorization file: No such file or directory
      09:55:11,179  INFO org.apache.zeppelin.interpreter.InterpreterFactory:131 - shiroEnabled: false
      09:55:11,185  INFO org.apache.zeppelin.user.Credentials:102 - /tmp/ZeppelinLTest_1493373311175/conf/credentials.json
      09:55:11,186  INFO org.apache.zeppelin.notebook.Notebook:127 - Notebook indexing started...
      09:55:11,187  INFO org.apache.zeppelin.notebook.Notebook:129 - Notebook indexing finished: 0 indexed in 0s
      09:55:11,193 ERROR org.apache.zeppelin.notebook.NotebookAuthorization:156 - Error saving notebook authorization file: No such file or directory
      09:55:11,198  INFO org.apache.zeppelin.interpreter.InterpreterFactory:131 - shiroEnabled: false
      09:55:11,201  INFO org.apache.zeppelin.user.Credentials:102 - /tmp/ZeppelinLTest_1493373311194/conf/credentials.json
      09:55:11,202  INFO org.apache.zeppelin.notebook.Notebook:127 - Notebook indexing started...
      09:55:11,202  INFO org.apache.zeppelin.notebook.Notebook:129 - Notebook indexing finished: 0 indexed in 0s
      09:55:11,212  INFO org.apache.zeppelin.interpreter.InterpreterFactory:189 - Create interpreter instance mock1 for note 2CE4S9S44
      09:55:11,212  INFO org.apache.zeppelin.interpreter.InterpreterFactory:229 - Create repl org.apache.zeppelin.interpreter.mock.MockInterpreter1 from mock1
      09:55:11,212  INFO org.apache.zeppelin.interpreter.InterpreterFactory:222 - Interpreter org.apache.zeppelin.interpreter.mock.MockInterpreter1 806019848 created
      09:55:11,213  INFO org.apache.zeppelin.notebook.Paragraph:367 - run paragraph 20170428-095511_2048136513 using null org.apache.zeppelin.interpreter.LazyOpenInterpreter@300ae308
      09:55:11,214  INFO org.apache.zeppelin.notebook.Paragraph:367 - run paragraph 20170428-095511_1899843147 using null org.apache.zeppelin.interpreter.LazyOpenInterpreter@300ae308
      09:55:11,215  INFO org.apache.zeppelin.interpreter.InterpreterGroup:185 - Close interpreter group 2CGAYCQY5:shared_process for session: shared_session
      09:55:11,216  INFO org.apache.zeppelin.interpreter.InterpreterFactory:189 - Create interpreter instance mock1 for note 2CE4S9S44
      09:55:11,216  INFO org.apache.zeppelin.interpreter.InterpreterFactory:229 - Create repl org.apache.zeppelin.interpreter.mock.MockInterpreter1 from mock1
      09:55:11,217  INFO org.apache.zeppelin.interpreter.InterpreterFactory:222 - Interpreter org.apache.zeppelin.interpreter.mock.MockInterpreter1 579271983 created
      09:55:11,217  INFO org.apache.zeppelin.interpreter.InterpreterFactory:189 - Create interpreter instance mock1 for note 2CG2V9RJT
      09:55:11,217  INFO org.apache.zeppelin.interpreter.InterpreterFactory:229 - Create repl org.apache.zeppelin.interpreter.mock.MockInterpreter1 from mock1
      09:55:11,218  INFO org.apache.zeppelin.interpreter.InterpreterFactory:222 - Interpreter org.apache.zeppelin.interpreter.mock.MockInterpreter1 703635618 created
      09:55:11,218  INFO org.apache.zeppelin.notebook.Paragraph:367 - run paragraph 20170428-095511_2048136513 using null org.apache.zeppelin.interpreter.LazyOpenInterpreter@2286fd2f
      09:55:11,219  INFO org.apache.zeppelin.notebook.Paragraph:367 - run paragraph 20170428-095511_1899843147 using null org.apache.zeppelin.interpreter.LazyOpenInterpreter@29f0a0a2
      09:55:11,219  INFO org.apache.zeppelin.interpreter.InterpreterGroup:185 - Close interpreter group 2CGAYCQY5:shared_process for session: 2CE4S9S44
      09:55:11,220  INFO org.apache.zeppelin.interpreter.InterpreterGroup:185 - Close interpreter group 2CED7KYTQ:shared_process for session: 2CE4S9S44
      09:55:11,220 ERROR org.apache.zeppelin.notebook.NotebookAuthorization:156 - Error saving notebook authorization file: No such file or directory
      09:55:11,221  INFO org.apache.zeppelin.interpreter.InterpreterGroup:185 - Close interpreter group 2CGAYCQY5:shared_process for session: 2CG2V9RJT
      09:55:11,222  INFO org.apache.zeppelin.interpreter.InterpreterGroup:185 - Close interpreter group 2CED7KYTQ:shared_process for session: 2CG2V9RJT
      09:55:11,222 ERROR org.apache.zeppelin.notebook.NotebookAuthorization:156 - Error saving notebook authorization file: No such file or directory
      09:55:11,228  INFO org.apache.zeppelin.interpreter.InterpreterFactory:131 - shiroEnabled: false
      09:55:11,231  INFO org.apache.zeppelin.user.Credentials:102 - /tmp/ZeppelinLTest_1493373311224/conf/credentials.json
      09:55:11,232  INFO org.apache.zeppelin.notebook.Notebook:127 - Notebook indexing started...
      09:55:11,232  INFO org.apache.zeppelin.notebook.Notebook:129 - Notebook indexing finished: 0 indexed in 0s
      09:55:11,247 ERROR org.apache.zeppelin.notebook.repo.VFSNotebookRepo:151 - Can't read note file:///tmp/ZeppelinLTest_1493373311224/notebook/2BQA35CJZ
      com.google.gson.JsonSyntaxException: 2016-03-29T16:21:09-0700
      	at com.google.gson.internal.bind.DateTypeAdapter.deserializeToDate(DateTypeAdapter.java:81)
      	at com.google.gson.internal.bind.DateTypeAdapter.read(DateTypeAdapter.java:66)
      	at com.google.gson.internal.bind.DateTypeAdapter.read(DateTypeAdapter.java:41)
      	at com.google.gson.internal.bind.ReflectiveTypeAdapterFactory$1.read(ReflectiveTypeAdapterFactory.java:93)
      	at com.google.gson.internal.bind.ReflectiveTypeAdapterFactory$Adapter.read(ReflectiveTypeAdapterFactory.java:172)
      	at com.google.gson.internal.bind.TypeAdapterRuntimeTypeWrapper.read(TypeAdapterRuntimeTypeWrapper.java:40)
      	at com.google.gson.internal.bind.CollectionTypeAdapterFactory$Adapter.read(CollectionTypeAdapterFactory.java:81)
      	at com.google.gson.internal.bind.CollectionTypeAdapterFactory$Adapter.read(CollectionTypeAdapterFactory.java:60)
      	at com.google.gson.internal.bind.ReflectiveTypeAdapterFactory$1.read(ReflectiveTypeAdapterFactory.java:93)
      	at com.google.gson.internal.bind.ReflectiveTypeAdapterFactory$Adapter.read(ReflectiveTypeAdapterFactory.java:172)
      	at com.google.gson.Gson.fromJson(Gson.java:791)
      	at com.google.gson.Gson.fromJson(Gson.java:757)
      	at com.google.gson.Gson.fromJson(Gson.java:706)
      	at com.google.gson.Gson.fromJson(Gson.java:678)
      	at org.apache.zeppelin.notebook.Note.fromJson(Note.java:898)
      	at org.apache.zeppelin.notebook.repo.VFSNotebookRepo.getNote(VFSNotebookRepo.java:178)
      	at org.apache.zeppelin.notebook.repo.VFSNotebookRepo.getNoteInfo(VFSNotebookRepo.java:201)
      	at org.apache.zeppelin.notebook.repo.VFSNotebookRepo.list(VFSNotebookRepo.java:146)
      	at org.apache.zeppelin.notebook.Notebook.reloadAllNotes(Notebook.java:577)
      	at org.apache.zeppelin.notebook.NotebookTest.testReloadAllNotes(NotebookTest.java:193)
      	at sun.reflect.NativeMethodAccessorImpl.invoke0(Native Method)
      	at sun.reflect.NativeMethodAccessorImpl.invoke(NativeMethodAccessorImpl.java:57)
      	at sun.reflect.DelegatingMethodAccessorImpl.invoke(DelegatingMethodAccessorImpl.java:43)
      	at java.lang.reflect.Method.invoke(Method.java:606)
      	at org.junit.runners.model.FrameworkMethod$1.runReflectiveCall(FrameworkMethod.java:50)
      	at org.junit.internal.runners.model.ReflectiveCallable.run(ReflectiveCallable.java:12)
      	at org.junit.runners.model.FrameworkMethod.invokeExplosively(FrameworkMethod.java:47)
      	at org.junit.internal.runners.statements.InvokeMethod.evaluate(InvokeMethod.java:17)
      	at org.junit.internal.runners.statements.RunBefores.evaluate(RunBefores.java:26)
      	at org.junit.internal.runners.statements.RunAfters.evaluate(RunAfters.java:27)
      	at org.junit.runners.ParentRunner.runLeaf(ParentRunner.java:325)
      	at org.junit.runners.BlockJUnit4ClassRunner.runChild(BlockJUnit4ClassRunner.java:78)
      	at org.junit.runners.BlockJUnit4ClassRunner.runChild(BlockJUnit4ClassRunner.java:57)
      	at org.junit.runners.ParentRunner$3.run(ParentRunner.java:290)
      	at org.junit.runners.ParentRunner$1.schedule(ParentRunner.java:71)
      	at org.junit.runners.ParentRunner.runChildren(ParentRunner.java:288)
      	at org.junit.runners.ParentRunner.access$000(ParentRunner.java:58)
      	at org.junit.runners.ParentRunner$2.evaluate(ParentRunner.java:268)
      	at org.junit.runners.ParentRunner.run(ParentRunner.java:363)
      	at org.apache.maven.surefire.junit4.JUnit4Provider.execute(JUnit4Provider.java:264)
      	at org.apache.maven.surefire.junit4.JUnit4Provider.executeTestSet(JUnit4Provider.java:153)
      	at org.apache.maven.surefire.junit4.JUnit4Provider.invoke(JUnit4Provider.java:124)
      	at org.apache.maven.surefire.booter.ForkedBooter.invokeProviderInSameClassLoader(ForkedBooter.java:200)
      	at org.apache.maven.surefire.booter.ForkedBooter.runSuitesInProcess(ForkedBooter.java:153)
      	at org.apache.maven.surefire.booter.ForkedBooter.main(ForkedBooter.java:103)
      Caused by: java.text.ParseException: Unparseable date: "2016-03-29T16:21:09-0700"
      	at java.text.DateFormat.parse(DateFormat.java:357)
      	at com.google.gson.internal.bind.DateTypeAdapter.deserializeToDate(DateTypeAdapter.java:79)
      	... 44 more
      09:55:11,256  INFO org.apache.zeppelin.notebook.FolderView:107 - Create folder /
      09:55:11,256  INFO org.apache.zeppelin.notebook.Folder:168 - Set parent of / to /
      09:55:11,256  INFO org.apache.zeppelin.notebook.Folder:184 - Add note 2A94M5J1Z to folder /
      09:55:11,266  INFO org.apache.zeppelin.interpreter.InterpreterFactory:131 - shiroEnabled: false
      09:55:11,269  INFO org.apache.zeppelin.user.Credentials:102 - /tmp/ZeppelinLTest_1493373311262/conf/credentials.json
      09:55:11,270  INFO org.apache.zeppelin.notebook.Notebook:127 - Notebook indexing started...
      09:55:11,270  INFO org.apache.zeppelin.notebook.Notebook:129 - Notebook indexing finished: 0 indexed in 0s
      09:55:11,275  INFO org.apache.zeppelin.notebook.FolderView:205 - Note name changed:  -> MyNote
      09:55:11,275  INFO org.apache.zeppelin.notebook.FolderView:107 - Create folder /
      09:55:11,275  INFO org.apache.zeppelin.notebook.Folder:168 - Set parent of / to /
      09:55:11,275  INFO org.apache.zeppelin.notebook.Folder:184 - Add note 2CGBVRM5D to folder /
      09:55:11,276  INFO org.apache.zeppelin.notebook.FolderView:205 - Note name changed: MyNote -> /MyNote
      09:55:11,276  INFO org.apache.zeppelin.notebook.FolderView:205 - Note name changed: /MyNote -> MyNote/sub
      09:55:11,276  INFO org.apache.zeppelin.notebook.Folder:199 - Remove note 2CGBVRM5D from folder /
      09:55:11,276  INFO org.apache.zeppelin.notebook.FolderView:142 - Folder / is empty
      09:55:11,276  INFO org.apache.zeppelin.notebook.FolderView:129 - Remove folder /
      09:55:11,276  INFO org.apache.zeppelin.notebook.Folder:179 - Remove child / from /
      09:55:11,277  INFO org.apache.zeppelin.notebook.FolderView:107 - Create folder MyNote
      09:55:11,277  INFO org.apache.zeppelin.notebook.FolderView:107 - Create folder /
      09:55:11,277  INFO org.apache.zeppelin.notebook.Folder:168 - Set parent of / to /
      09:55:11,277  INFO org.apache.zeppelin.notebook.Folder:168 - Set parent of MyNote to /
      09:55:11,277  INFO org.apache.zeppelin.notebook.Folder:184 - Add note 2CGBVRM5D to folder MyNote
      09:55:11,277  INFO org.apache.zeppelin.notebook.FolderView:205 - Note name changed: MyNote/sub -> /MyNote/sub
      09:55:11,278  INFO org.apache.zeppelin.notebook.Folder:199 - Remove note 2CGBVRM5D from folder MyNote
      09:55:11,278  INFO org.apache.zeppelin.notebook.FolderView:142 - Folder MyNote is empty
      09:55:11,278  INFO org.apache.zeppelin.notebook.FolderView:129 - Remove folder MyNote
      09:55:11,278  INFO org.apache.zeppelin.notebook.Folder:179 - Remove child MyNote from /
      09:55:11,278  INFO org.apache.zeppelin.notebook.FolderView:142 - Folder / is empty
      09:55:11,278  INFO org.apache.zeppelin.notebook.FolderView:129 - Remove folder /
      09:55:11,279  INFO org.apache.zeppelin.notebook.Folder:179 - Remove child / from /
      09:55:11,279 ERROR org.apache.zeppelin.notebook.NotebookAuthorization:156 - Error saving notebook authorization file: No such file or directory
      09:55:11,284  INFO org.apache.zeppelin.interpreter.InterpreterFactory:131 - shiroEnabled: false
      09:55:11,288  INFO org.apache.zeppelin.user.Credentials:102 - /tmp/ZeppelinLTest_1493373311280/conf/credentials.json
      09:55:11,289  INFO org.apache.zeppelin.notebook.Notebook:127 - Notebook indexing started...
      09:55:11,289  INFO org.apache.zeppelin.notebook.Notebook:129 - Notebook indexing finished: 0 indexed in 0s
      09:55:11,294 ERROR org.apache.zeppelin.notebook.NotebookAuthorization:156 - Error saving notebook authorization file: No such file or directory
      09:55:11,294 ERROR org.apache.zeppelin.notebook.NotebookAuthorization:156 - Error saving notebook authorization file: No such file or directory
      09:55:11,294 ERROR org.apache.zeppelin.notebook.NotebookAuthorization:156 - Error saving notebook authorization file: No such file or directory
      09:55:11,295 ERROR org.apache.zeppelin.notebook.NotebookAuthorization:156 - Error saving notebook authorization file: No such file or directory
      09:55:11,295 ERROR org.apache.zeppelin.notebook.NotebookAuthorization:156 - Error saving notebook authorization file: No such file or directory
      09:55:11,300  INFO org.apache.zeppelin.interpreter.InterpreterFactory:131 - shiroEnabled: false
      09:55:11,304  INFO org.apache.zeppelin.user.Credentials:102 - /tmp/ZeppelinLTest_1493373311297/conf/credentials.json
      09:55:11,305  INFO org.apache.zeppelin.notebook.Notebook:127 - Notebook indexing started...
      09:55:11,305  INFO org.apache.zeppelin.notebook.Notebook:129 - Notebook indexing finished: 0 indexed in 0s
      09:55:11,313  INFO org.apache.zeppelin.interpreter.InterpreterFactory:189 - Create interpreter instance mock1 for note 2CF8U3B9T
      09:55:11,314  INFO org.apache.zeppelin.interpreter.InterpreterFactory:229 - Create repl org.apache.zeppelin.interpreter.mock.MockInterpreter1 from mock1
      09:55:11,314  INFO org.apache.zeppelin.interpreter.InterpreterFactory:222 - Interpreter org.apache.zeppelin.interpreter.mock.MockInterpreter1 1936526464 created
      09:55:11,315  INFO org.apache.zeppelin.notebook.Paragraph:367 - run paragraph 20170428-095511_703659433 using null org.apache.zeppelin.interpreter.LazyOpenInterpreter@736d0c80
      09:55:11,316  INFO org.apache.zeppelin.notebook.Paragraph:367 - run paragraph 20170428-095511_1663504237 using null org.apache.zeppelin.interpreter.LazyOpenInterpreter@736d0c80
      09:55:11,317  INFO org.apache.zeppelin.interpreter.InterpreterGroup:185 - Close interpreter group 2CH52NY8T:shared_process for session: shared_session
      09:55:11,319  INFO org.apache.zeppelin.interpreter.InterpreterFactory:189 - Create interpreter instance mock1 for note 2CF8U3B9T
      09:55:11,319  INFO org.apache.zeppelin.interpreter.InterpreterFactory:229 - Create repl org.apache.zeppelin.interpreter.mock.MockInterpreter1 from mock1
      09:55:11,319  INFO org.apache.zeppelin.interpreter.InterpreterFactory:222 - Interpreter org.apache.zeppelin.interpreter.mock.MockInterpreter1 1849605040 created
      09:55:11,320  INFO org.apache.zeppelin.interpreter.InterpreterFactory:189 - Create interpreter instance mock1 for note 2CGP3ZNDP
      09:55:11,320  INFO org.apache.zeppelin.interpreter.InterpreterFactory:229 - Create repl org.apache.zeppelin.interpreter.mock.MockInterpreter1 from mock1
      09:55:11,321  INFO org.apache.zeppelin.interpreter.InterpreterFactory:222 - Interpreter org.apache.zeppelin.interpreter.mock.MockInterpreter1 806840975 created
      09:55:11,321  INFO org.apache.zeppelin.notebook.Paragraph:367 - run paragraph 20170428-095511_703659433 using null org.apache.zeppelin.interpreter.LazyOpenInterpreter@6e3ebbb0
      09:55:11,322  INFO org.apache.zeppelin.notebook.Paragraph:367 - run paragraph 20170428-095511_1663504237 using null org.apache.zeppelin.interpreter.LazyOpenInterpreter@30176a8f
      09:55:11,322  INFO org.apache.zeppelin.interpreter.InterpreterGroup:185 - Close interpreter group 2CH52NY8T:shared_process for session: 2CGP3ZNDP
      09:55:11,323  INFO org.apache.zeppelin.interpreter.InterpreterGroup:185 - Close interpreter group 2CH52NY8T:shared_process for session: 2CF8U3B9T
      09:55:11,324  INFO org.apache.zeppelin.interpreter.InterpreterFactory:189 - Create interpreter instance mock1 for note 2CF8U3B9T
      09:55:11,325  INFO org.apache.zeppelin.interpreter.InterpreterFactory:229 - Create repl org.apache.zeppelin.interpreter.mock.MockInterpreter1 from mock1
      09:55:11,325  INFO org.apache.zeppelin.interpreter.InterpreterFactory:222 - Interpreter org.apache.zeppelin.interpreter.mock.MockInterpreter1 1424175659 created
      09:55:11,325  INFO org.apache.zeppelin.interpreter.InterpreterFactory:189 - Create interpreter instance mock1 for note 2CGP3ZNDP
      09:55:11,325  INFO org.apache.zeppelin.interpreter.InterpreterFactory:229 - Create repl org.apache.zeppelin.interpreter.mock.MockInterpreter1 from mock1
      09:55:11,326  INFO org.apache.zeppelin.notebook.Paragraph:367 - run paragraph 20170428-095511_703659433 using null org.apache.zeppelin.interpreter.LazyOpenInterpreter@54e3322b
      09:55:11,326  INFO org.apache.zeppelin.interpreter.InterpreterFactory:222 - Interpreter org.apache.zeppelin.interpreter.mock.MockInterpreter1 84066694 created
      09:55:11,327  INFO org.apache.zeppelin.notebook.Paragraph:367 - run paragraph 20170428-095511_1663504237 using null org.apache.zeppelin.interpreter.LazyOpenInterpreter@502c186
      09:55:11,328  INFO org.apache.zeppelin.interpreter.InterpreterGroup:185 - Close interpreter group 2CH52NY8T::2CF8U3B9T for session: shared_session
      09:55:11,329 ERROR org.apache.zeppelin.notebook.NotebookAuthorization:156 - Error saving notebook authorization file: No such file or directory
      09:55:11,329  INFO org.apache.zeppelin.interpreter.InterpreterGroup:185 - Close interpreter group 2CH52NY8T::2CGP3ZNDP for session: shared_session
      09:55:11,330 ERROR org.apache.zeppelin.notebook.NotebookAuthorization:156 - Error saving notebook authorization file: No such file or directory
      09:55:11,336  INFO org.apache.zeppelin.interpreter.InterpreterFactory:131 - shiroEnabled: false
      09:55:11,338  INFO org.apache.zeppelin.user.Credentials:102 - /tmp/ZeppelinLTest_1493373311332/conf/credentials.json
      09:55:11,340  INFO org.apache.zeppelin.notebook.Notebook:127 - Notebook indexing started...
      09:55:11,340  INFO org.apache.zeppelin.notebook.Notebook:129 - Notebook indexing finished: 0 indexed in 0s
      09:55:11,345 ERROR org.apache.zeppelin.notebook.NotebookAuthorization:156 - Error saving notebook authorization file: No such file or directory
      09:55:11,350  INFO org.apache.zeppelin.interpreter.InterpreterFactory:131 - shiroEnabled: false
      09:55:11,353  INFO org.apache.zeppelin.user.Credentials:102 - /tmp/ZeppelinLTest_1493373311347/conf/credentials.json
      09:55:11,354  INFO org.apache.zeppelin.notebook.Notebook:127 - Notebook indexing started...
      09:55:11,354  INFO org.apache.zeppelin.notebook.Notebook:129 - Notebook indexing finished: 0 indexed in 0s
      09:55:11,360  INFO org.apache.zeppelin.interpreter.InterpreterFactory:189 - Create interpreter instance mock1 for note 2CFM7V45V
      09:55:11,360  INFO org.apache.zeppelin.interpreter.InterpreterFactory:229 - Create repl org.apache.zeppelin.interpreter.mock.MockInterpreter1 from mock1
      09:55:11,360  INFO org.apache.zeppelin.interpreter.InterpreterFactory:222 - Interpreter org.apache.zeppelin.interpreter.mock.MockInterpreter1 220607672 created
      09:55:11,361  INFO org.apache.zeppelin.interpreter.InterpreterFactory:189 - Create interpreter instance mock2 for note 2CFM7V45V
      09:55:11,361  INFO org.apache.zeppelin.interpreter.InterpreterFactory:229 - Create repl org.apache.zeppelin.interpreter.mock.MockInterpreter2 from mock2
      09:55:11,362  INFO org.apache.zeppelin.notebook.Paragraph:367 - run paragraph 20170428-095511_701614861 using null org.apache.zeppelin.interpreter.LazyOpenInterpreter@d2634b8
      09:55:11,362  INFO org.apache.zeppelin.interpreter.InterpreterFactory:222 - Interpreter org.apache.zeppelin.interpreter.mock.MockInterpreter2 1760056040 created
      09:55:11,363  INFO org.apache.zeppelin.notebook.Paragraph:367 - run paragraph 20170428-095511_208263150 using mock2 org.apache.zeppelin.interpreter.LazyOpenInterpreter@68e852e8
      09:55:11,366 ERROR org.apache.zeppelin.notebook.NotebookAuthorization:156 - Error saving notebook authorization file: No such file or directory
      09:55:11,371  INFO org.apache.zeppelin.interpreter.InterpreterFactory:131 - shiroEnabled: false
      09:55:11,374  INFO org.apache.zeppelin.user.Credentials:102 - /tmp/ZeppelinLTest_1493373311367/conf/credentials.json
      09:55:11,375  INFO org.apache.zeppelin.notebook.Notebook:127 - Notebook indexing started...
      09:55:11,375  INFO org.apache.zeppelin.notebook.Notebook:129 - Notebook indexing finished: 0 indexed in 0s
      09:55:11,380  INFO org.apache.zeppelin.interpreter.InterpreterFactory:189 - Create interpreter instance mock1 for note 2CEJNYDMP
      09:55:11,380  INFO org.apache.zeppelin.interpreter.InterpreterFactory:229 - Create repl org.apache.zeppelin.interpreter.mock.MockInterpreter1 from mock1
      09:55:11,380  INFO org.apache.zeppelin.interpreter.InterpreterFactory:222 - Interpreter org.apache.zeppelin.interpreter.mock.MockInterpreter1 1358697351 created
      09:55:11,381  INFO org.apache.zeppelin.notebook.Paragraph:367 - run paragraph 20170428-095511_1835877325 using null org.apache.zeppelin.interpreter.LazyOpenInterpreter@50fc1387
      09:55:11,386  INFO org.apache.zeppelin.notebook.FolderView:205 - Note name changed:  -> clone note with Exception result
      09:55:11,386  INFO org.apache.zeppelin.notebook.FolderView:107 - Create folder /
      09:55:11,386  INFO org.apache.zeppelin.notebook.Folder:168 - Set parent of / to /
      09:55:11,386  INFO org.apache.zeppelin.notebook.Folder:184 - Add note 2CHP8EPXS to folder /
      09:55:11,388  WARN org.apache.zeppelin.notebook.Note:330 - Paragraph 20170428-095511_1835877325 has a result with exception. java.lang.IllegalStateException: Expected BEGIN_OBJECT but was STRING at line 1 column 12
      09:55:11,391 ERROR org.apache.zeppelin.notebook.NotebookAuthorization:156 - Error saving notebook authorization file: No such file or directory
      09:55:11,392  INFO org.apache.zeppelin.notebook.Folder:199 - Remove note 2CHP8EPXS from folder /
      09:55:11,392  INFO org.apache.zeppelin.notebook.FolderView:142 - Folder / is empty
      09:55:11,392  INFO org.apache.zeppelin.notebook.FolderView:129 - Remove folder /
      09:55:11,392  INFO org.apache.zeppelin.notebook.Folder:179 - Remove child / from /
      09:55:11,393 ERROR org.apache.zeppelin.notebook.NotebookAuthorization:156 - Error saving notebook authorization file: No such file or directory
      09:55:11,398  INFO org.apache.zeppelin.interpreter.InterpreterFactory:131 - shiroEnabled: false
      09:55:11,401  INFO org.apache.zeppelin.user.Credentials:102 - /tmp/ZeppelinLTest_1493373311394/conf/credentials.json
      09:55:11,402  INFO org.apache.zeppelin.notebook.Notebook:127 - Notebook indexing started...
      09:55:11,402  INFO org.apache.zeppelin.notebook.Notebook:129 - Notebook indexing finished: 0 indexed in 0s
      09:55:11,406  INFO org.apache.zeppelin.interpreter.InterpreterFactory:189 - Create interpreter instance mock1 for note 2CHQTXEAM
      09:55:11,407  INFO org.apache.zeppelin.interpreter.InterpreterFactory:229 - Create repl org.apache.zeppelin.interpreter.mock.MockInterpreter1 from mock1
      09:55:11,407  INFO org.apache.zeppelin.interpreter.InterpreterFactory:222 - Interpreter org.apache.zeppelin.interpreter.mock.MockInterpreter1 2032418547 created
      09:55:11,408  INFO org.apache.zeppelin.notebook.Paragraph:367 - run paragraph 20170428-095511_367503488 using null org.apache.zeppelin.interpreter.LazyOpenInterpreter@79243ef3
      09:55:11,422  INFO org.apache.zeppelin.notebook.FolderView:205 - Note name changed:  -> Title
      09:55:11,422  INFO org.apache.zeppelin.notebook.FolderView:107 - Create folder /
      09:55:11,422  INFO org.apache.zeppelin.notebook.Folder:168 - Set parent of / to /
      09:55:11,422  INFO org.apache.zeppelin.notebook.Folder:184 - Add note 2CETSMTX2 to folder /
      09:55:11,431 ERROR org.apache.zeppelin.notebook.NotebookAuthorization:156 - Error saving notebook authorization file: No such file or directory
      09:55:11,434  INFO org.apache.zeppelin.notebook.FolderView:205 - Note name changed:  -> Title2
      09:55:11,434  INFO org.apache.zeppelin.notebook.Folder:184 - Add note 2CE8QDNB1 to folder /
      09:55:11,435 ERROR org.apache.zeppelin.notebook.NotebookAuthorization:156 - Error saving notebook authorization file: No such file or directory
      09:55:11,439 ERROR org.apache.zeppelin.notebook.NotebookAuthorization:156 - Error saving notebook authorization file: No such file or directory
      09:55:11,440  INFO org.apache.zeppelin.notebook.Folder:199 - Remove note 2CETSMTX2 from folder /
      09:55:11,440 ERROR org.apache.zeppelin.notebook.NotebookAuthorization:156 - Error saving notebook authorization file: No such file or directory
      09:55:11,441  INFO org.apache.zeppelin.notebook.Folder:199 - Remove note 2CE8QDNB1 from folder /
      09:55:11,441  INFO org.apache.zeppelin.notebook.FolderView:142 - Folder / is empty
      09:55:11,442  INFO org.apache.zeppelin.notebook.FolderView:129 - Remove folder /
      09:55:11,442  INFO org.apache.zeppelin.notebook.Folder:179 - Remove child / from /
      09:55:11,442 ERROR org.apache.zeppelin.notebook.NotebookAuthorization:156 - Error saving notebook authorization file: No such file or directory
      09:55:11,447  INFO org.apache.zeppelin.interpreter.InterpreterFactory:131 - shiroEnabled: false
      09:55:11,450  INFO org.apache.zeppelin.user.Credentials:102 - /tmp/ZeppelinLTest_1493373311444/conf/credentials.json
      09:55:11,452  INFO org.apache.zeppelin.notebook.Notebook:127 - Notebook indexing started...
      09:55:11,452  INFO org.apache.zeppelin.notebook.Notebook:129 - Notebook indexing finished: 0 indexed in 0s
      09:55:11,456  INFO org.apache.zeppelin.interpreter.InterpreterFactory:189 - Create interpreter instance mock1 for note 2CGHPR9FT
      09:55:11,457  INFO org.apache.zeppelin.interpreter.InterpreterFactory:229 - Create repl org.apache.zeppelin.interpreter.mock.MockInterpreter1 from mock1
      09:55:11,457  INFO org.apache.zeppelin.interpreter.InterpreterFactory:222 - Interpreter org.apache.zeppelin.interpreter.mock.MockInterpreter1 278714052 created
      09:55:11,458  INFO org.apache.zeppelin.notebook.Paragraph:367 - run paragraph 20170428-095511_734433392 using null org.apache.zeppelin.interpreter.LazyOpenInterpreter@109cd6c4
      09:55:11,459  INFO org.apache.zeppelin.notebook.Paragraph:367 - run paragraph 20170428-095511_1980329887 using null org.apache.zeppelin.interpreter.LazyOpenInterpreter@109cd6c4
      09:55:11,460 ERROR org.apache.zeppelin.notebook.NotebookAuthorization:156 - Error saving notebook authorization file: No such file or directory
      09:55:11,465  INFO org.apache.zeppelin.interpreter.InterpreterFactory:131 - shiroEnabled: false
      09:55:11,467  INFO org.apache.zeppelin.user.Credentials:102 - /tmp/ZeppelinLTest_1493373311462/conf/credentials.json
      09:55:11,468  INFO org.apache.zeppelin.notebook.Notebook:127 - Notebook indexing started...
      09:55:11,469  INFO org.apache.zeppelin.notebook.Notebook:129 - Notebook indexing finished: 0 indexed in 0s
      09:55:11,476  INFO org.apache.zeppelin.interpreter.InterpreterFactory:189 - Create interpreter instance mock1 for note 2CDWZ4CWE
      09:55:11,476  INFO org.apache.zeppelin.interpreter.InterpreterFactory:229 - Create repl org.apache.zeppelin.interpreter.mock.MockInterpreter1 from mock1
      09:55:11,476  INFO org.apache.zeppelin.interpreter.InterpreterFactory:222 - Interpreter org.apache.zeppelin.interpreter.mock.MockInterpreter1 1212250507 created
      09:55:11,477  INFO org.apache.zeppelin.notebook.Paragraph:367 - run paragraph 20170428-095511_695078585 using null org.apache.zeppelin.interpreter.LazyOpenInterpreter@4841798b
      09:55:12,002  INFO org.apache.zeppelin.notebook.Paragraph:367 - run paragraph 20170428-095511_695078585 using null org.apache.zeppelin.interpreter.LazyOpenInterpreter@4841798b
      09:55:13,001  INFO org.apache.zeppelin.notebook.Paragraph:367 - run paragraph 20170428-095511_695078585 using null org.apache.zeppelin.interpreter.LazyOpenInterpreter@4841798b
      09:55:14,001  INFO org.apache.zeppelin.notebook.Paragraph:367 - run paragraph 20170428-095511_695078585 using null org.apache.zeppelin.interpreter.LazyOpenInterpreter@4841798b
      09:55:15,002  INFO org.apache.zeppelin.notebook.Paragraph:367 - run paragraph 20170428-095511_695078585 using null org.apache.zeppelin.interpreter.LazyOpenInterpreter@4841798b
      09:55:16,002  INFO org.apache.zeppelin.notebook.Paragraph:367 - run paragraph 20170428-095511_695078585 using null org.apache.zeppelin.interpreter.LazyOpenInterpreter@4841798b
      09:55:17,001  INFO org.apache.zeppelin.notebook.Paragraph:367 - run paragraph 20170428-095511_695078585 using null org.apache.zeppelin.interpreter.LazyOpenInterpreter@4841798b
      09:55:18,001  INFO org.apache.zeppelin.notebook.Paragraph:367 - run paragraph 20170428-095511_695078585 using null org.apache.zeppelin.interpreter.LazyOpenInterpreter@4841798b
      09:55:19,002  INFO org.apache.zeppelin.notebook.Paragraph:367 - run paragraph 20170428-095511_695078585 using null org.apache.zeppelin.interpreter.LazyOpenInterpreter@4841798b
      09:55:20,001  INFO org.apache.zeppelin.notebook.Paragraph:367 - run paragraph 20170428-095511_695078585 using null org.apache.zeppelin.interpreter.LazyOpenInterpreter@4841798b
      09:55:21,001  INFO org.apache.zeppelin.notebook.Paragraph:367 - run paragraph 20170428-095511_695078585 using null org.apache.zeppelin.interpreter.LazyOpenInterpreter@4841798b
      09:55:22,002  INFO org.apache.zeppelin.notebook.Paragraph:367 - run paragraph 20170428-095511_695078585 using null org.apache.zeppelin.interpreter.LazyOpenInterpreter@4841798b
      09:55:23,001  INFO org.apache.zeppelin.notebook.Paragraph:367 - run paragraph 20170428-095511_695078585 using null org.apache.zeppelin.interpreter.LazyOpenInterpreter@4841798b
      09:55:23,003 ERROR org.apache.zeppelin.notebook.NotebookAuthorization:156 - Error saving notebook authorization file: No such file or directory
      Tests run: 32, Failures: 1, Errors: 0, Skipped: 0, Time elapsed: 23.3 sec <<< FAILURE! - in org.apache.zeppelin.notebook.NotebookTest
      testReloadAllNotes(org.apache.zeppelin.notebook.NotebookTest)  Time elapsed: 0.038 sec  <<< FAILURE!
      java.lang.AssertionError: expected:<1> but was:<2>
      	at org.junit.Assert.fail(Assert.java:88)
      	at org.junit.Assert.failNotEquals(Assert.java:834)
      	at org.junit.Assert.assertEquals(Assert.java:645)
      	at org.junit.Assert.assertEquals(Assert.java:631)
      	at org.apache.zeppelin.notebook.NotebookTest.testReloadAllNotes(NotebookTest.java:195)
      
      
      Results :
      
      Failed tests: 
        NotebookTest.testReloadAllNotes:195 expected:<1> but was:<2>
      
      Tests run: 32, Failures: 1, Errors: 0, Skipped: 0
      

        Attachments

          Issue Links

            Activity

              People

              • Assignee:
                pravindsilva Pravin Dsilva
                Reporter:
                AlexanderShoshin Alexander Shoshin
              • Votes:
                0 Vote for this issue
                Watchers:
                4 Start watching this issue

                Dates

                • Created:
                  Updated:
                  Resolved: