Uploaded image for project: 'Hadoop YARN'
  1. Hadoop YARN
  2. YARN-9988

Hadoop Native Build fails at hadoop-yarn-server-nodemanager

VotersWatch issueWatchersCreate sub-taskLinkCloneUpdate Comment AuthorReplace String in CommentUpdate Comment VisibilityDelete Comments
    XMLWordPrintableJSON

    Details

    • Type: Bug
    • Status: Resolved
    • Priority: Blocker
    • Resolution: Won't Fix
    • Affects Version/s: 3.3.0
    • Fix Version/s: None
    • Component/s: nodemanager
    • Labels:
      None

      Description

      Hadoop Native Build failsĀ  at hadoop-yarn-server-nodemanager. Have observed this inĀ YARN-9781.

      [WARNING] make[2]: Leaving directory '/testptch/hadoop/hadoop-yarn-project/hadoop-yarn/hadoop-yarn-server/hadoop-yarn-server-nodemanager/target/native'
      [WARNING] CMakeFiles/Makefile2:131: recipe for target 'CMakeFiles/container-executor.dir/all' failed
      [WARNING] make[2]: Leaving directory '/testptch/hadoop/hadoop-yarn-project/hadoop-yarn/hadoop-yarn-server/hadoop-yarn-server-nodemanager/target/native'
      [WARNING] CMakeFiles/Makefile2:236: recipe for target 'CMakeFiles/test-container-executor.dir/all' failed
      [WARNING] Linking CXX static library libgtest.a
      [WARNING] /opt/cmake/bin/cmake -P CMakeFiles/gtest.dir/cmake_clean_target.cmake
      [WARNING] /opt/cmake/bin/cmake -E cmake_link_script CMakeFiles/gtest.dir/link.txt --verbose=1
      [WARNING] /usr/bin/ar cq libgtest.a  CMakeFiles/gtest.dir/testptch/hadoop/hadoop-common-project/hadoop-common/src/main/native/gtest/gtest-all.cc.o
      [WARNING] /usr/bin/ranlib libgtest.a
      [WARNING] make[2]: Leaving directory '/testptch/hadoop/hadoop-yarn-project/hadoop-yarn/hadoop-yarn-server/hadoop-yarn-server-nodemanager/target/native'
      [WARNING] /opt/cmake/bin/cmake -E cmake_progress_report /testptch/hadoop/hadoop-yarn-project/hadoop-yarn/hadoop-yarn-server/hadoop-yarn-server-nodemanager/target/native/CMakeFiles  35
      [WARNING] [ 62%] Built target gtest
      [WARNING] make[1]: Leaving directory '/testptch/hadoop/hadoop-yarn-project/hadoop-yarn/hadoop-yarn-server/hadoop-yarn-server-nodemanager/target/native'
      [WARNING] Makefile:76: recipe for target 'all' failed
      [WARNING] make[2]: *** No rule to make target '/testptch/hadoop/hadoop-yarn-project/hadoop-yarn/hadoop-yarn-server/hadoop-yarn-server-nodemanager/src/../../../../../hadoop-common-project/hadoop-common/target/native/target/usr/local/lib/libhadoop.a', needed by 'target/usr/local/bin/test-container-executor'.  Stop.
      [WARNING] make[2]: *** Waiting for unfinished jobs....
      [WARNING] make[2]: *** No rule to make target '/testptch/hadoop/hadoop-yarn-project/hadoop-yarn/hadoop-yarn-server/hadoop-yarn-server-nodemanager/src/../../../../../hadoop-common-project/hadoop-common/target/native/target/usr/local/lib/libhadoop.a', needed by 'target/usr/local/bin/container-executor'.  Stop.
      [WARNING] make[2]: *** Waiting for unfinished jobs....
      [WARNING] make[1]: *** [CMakeFiles/container-executor.dir/all] Error 2
      [WARNING] make[1]: *** Waiting for unfinished jobs....
      [WARNING] make[1]: *** [CMakeFiles/test-container-executor.dir/all] Error 2
      [WARNING] make: *** [all] Error 2 

        Attachments

        1. console
          135 kB
          Prabhu Joseph

          Activity

            People

            • Assignee:
              Unassigned
              Reporter:
              prabhujoseph Prabhu Joseph

              Dates

              • Created:
                Updated:
                Resolved:

                Issue deployment