Uploaded image for project: 'Hadoop YARN'
  1. Hadoop YARN
  2. YARN-9742

[JDK11] TestTimelineWebServicesWithSSL.testPutEntities fails

    XMLWordPrintableJSON

    Details

    • Type: Bug
    • Status: Open
    • Priority: Major
    • Resolution: Unresolved
    • Affects Version/s: 3.2.0
    • Fix Version/s: None
    • Component/s: timelineservice
    • Labels:
      None
    • Target Version/s:

      Description

      Tested on openjdk-11.0.2 on a Mac.

      Stack trace:

      [ERROR] Tests run: 3, Failures: 0, Errors: 3, Skipped: 0, Time elapsed: 8.206 s <<< FAILURE! - in org.apache.hadoop.yarn.server.timeline.webapp.TestTimelineWebServicesWithSSL
      [ERROR] testPutEntities(org.apache.hadoop.yarn.server.timeline.webapp.TestTimelineWebServicesWithSSL)  Time elapsed: 0.366 s  <<< ERROR!
      com.sun.jersey.api.client.ClientHandlerException: java.io.IOException: HTTPS hostname wrong:  should be <0.0.0.0>
      	at com.sun.jersey.client.urlconnection.URLConnectionClientHandler.handle(URLConnectionClientHandler.java:155)
      	at org.apache.hadoop.yarn.client.api.impl.TimelineConnector$TimelineJerseyRetryFilter$1.run(TimelineConnector.java:392)
      	at org.apache.hadoop.yarn.client.api.impl.TimelineConnector$TimelineClientConnectionRetry.retryOn(TimelineConnector.java:335)
      	at org.apache.hadoop.yarn.client.api.impl.TimelineConnector$TimelineJerseyRetryFilter.handle(TimelineConnector.java:405)
      	at com.sun.jersey.api.client.Client.handle(Client.java:652)
      	at com.sun.jersey.api.client.WebResource.handle(WebResource.java:682)
      	at com.sun.jersey.api.client.WebResource.access$200(WebResource.java:74)
      	at com.sun.jersey.api.client.WebResource$Builder.post(WebResource.java:570)
      	at org.apache.hadoop.yarn.client.api.impl.TimelineWriter.doPostingObject(TimelineWriter.java:152)
      	at org.apache.hadoop.yarn.server.timeline.webapp.TestTimelineWebServicesWithSSL$TestTimelineClient$1.doPostingObject(TestTimelineWebServicesWithSSL.java:139)
      	at org.apache.hadoop.yarn.client.api.impl.TimelineWriter$1.run(TimelineWriter.java:115)
      	at org.apache.hadoop.yarn.client.api.impl.TimelineWriter$1.run(TimelineWriter.java:112)
      	at java.base/java.security.AccessController.doPrivileged(Native Method)
      	at java.base/javax.security.auth.Subject.doAs(Subject.java:423)
      	at org.apache.hadoop.security.UserGroupInformation.doAs(UserGroupInformation.java:1891)
      	at org.apache.hadoop.yarn.client.api.impl.TimelineWriter.doPosting(TimelineWriter.java:112)
      	at org.apache.hadoop.yarn.client.api.impl.TimelineWriter.putEntities(TimelineWriter.java:92)
      	at org.apache.hadoop.yarn.client.api.impl.TimelineClientImpl.putEntities(TimelineClientImpl.java:178)
      	at org.apache.hadoop.yarn.server.timeline.webapp.TestTimelineWebServicesWithSSL.testPutEntities(TestTimelineWebServicesWithSSL.java:110)
      	at java.base/jdk.internal.reflect.NativeMethodAccessorImpl.invoke0(Native Method)
      	at java.base/jdk.internal.reflect.NativeMethodAccessorImpl.invoke(NativeMethodAccessorImpl.java:62)
      	at java.base/jdk.internal.reflect.DelegatingMethodAccessorImpl.invoke(DelegatingMethodAccessorImpl.java:43)
      	at java.base/java.lang.reflect.Method.invoke(Method.java:566)
      	at org.junit.runners.model.FrameworkMethod$1.runReflectiveCall(FrameworkMethod.java:50)
      	at org.junit.internal.runners.model.ReflectiveCallable.run(ReflectiveCallable.java:12)
      	at org.junit.runners.model.FrameworkMethod.invokeExplosively(FrameworkMethod.java:47)
      	at org.junit.internal.runners.statements.InvokeMethod.evaluate(InvokeMethod.java:17)
      	at org.junit.runners.ParentRunner.runLeaf(ParentRunner.java:325)
      	at org.junit.runners.BlockJUnit4ClassRunner.runChild(BlockJUnit4ClassRunner.java:78)
      	at org.junit.runners.BlockJUnit4ClassRunner.runChild(BlockJUnit4ClassRunner.java:57)
      	at org.junit.runners.ParentRunner$3.run(ParentRunner.java:290)
      	at org.junit.runners.ParentRunner$1.schedule(ParentRunner.java:71)
      	at org.junit.runners.ParentRunner.runChildren(ParentRunner.java:288)
      	at org.junit.runners.ParentRunner.access$000(ParentRunner.java:58)
      	at org.junit.runners.ParentRunner$2.evaluate(ParentRunner.java:268)
      	at org.junit.internal.runners.statements.RunBefores.evaluate(RunBefores.java:26)
      	at org.junit.internal.runners.statements.RunAfters.evaluate(RunAfters.java:27)
      	at org.junit.runners.ParentRunner.run(ParentRunner.java:363)
      	at org.apache.maven.surefire.junit4.JUnit4Provider.execute(JUnit4Provider.java:365)
      	at org.apache.maven.surefire.junit4.JUnit4Provider.executeWithRerun(JUnit4Provider.java:273)
      	at org.apache.maven.surefire.junit4.JUnit4Provider.executeTestSet(JUnit4Provider.java:238)
      	at org.apache.maven.surefire.junit4.JUnit4Provider.invoke(JUnit4Provider.java:159)
      	at org.apache.maven.surefire.booter.ForkedBooter.invokeProviderInSameClassLoader(ForkedBooter.java:384)
      	at org.apache.maven.surefire.booter.ForkedBooter.runSuitesInProcess(ForkedBooter.java:345)
      	at org.apache.maven.surefire.booter.ForkedBooter.execute(ForkedBooter.java:126)
      	at org.apache.maven.surefire.booter.ForkedBooter.main(ForkedBooter.java:418)
      Caused by: java.io.IOException: HTTPS hostname wrong:  should be <0.0.0.0>
      	at java.base/sun.net.www.protocol.https.HttpsClient.checkURLSpoofing(HttpsClient.java:648)
      	at java.base/sun.net.www.protocol.https.HttpsClient.afterConnect(HttpsClient.java:581)
      	at java.base/sun.net.www.protocol.https.AbstractDelegateHttpsURLConnection.connect(AbstractDelegateHttpsURLConnection.java:185)
      	at java.base/sun.net.www.protocol.http.HttpURLConnection.getOutputStream0(HttpURLConnection.java:1356)
      	at java.base/sun.net.www.protocol.http.HttpURLConnection.getOutputStream(HttpURLConnection.java:1331)
      	at java.base/sun.net.www.protocol.https.HttpsURLConnectionImpl.getOutputStream(HttpsURLConnectionImpl.java:241)
      	at com.sun.jersey.client.urlconnection.URLConnectionClientHandler$1$1.getOutputStream(URLConnectionClientHandler.java:238)
      	at com.sun.jersey.api.client.CommittingOutputStream.commitStream(CommittingOutputStream.java:117)
      	at com.sun.jersey.api.client.CommittingOutputStream.write(CommittingOutputStream.java:89)
      	at com.fasterxml.jackson.core.json.UTF8JsonGenerator._flushBuffer(UTF8JsonGenerator.java:2085)
      	at com.fasterxml.jackson.core.json.UTF8JsonGenerator.flush(UTF8JsonGenerator.java:1097)
      	at com.fasterxml.jackson.databind.ObjectWriter.writeValue(ObjectWriter.java:915)
      	at com.fasterxml.jackson.jaxrs.base.ProviderBase.writeTo(ProviderBase.java:625)
      	at com.sun.jersey.api.client.RequestWriter.writeRequestEntity(RequestWriter.java:300)
      	at com.sun.jersey.client.urlconnection.URLConnectionClientHandler._invoke(URLConnectionClientHandler.java:217)
      	at com.sun.jersey.client.urlconnection.URLConnectionClientHandler.handle(URLConnectionClientHandler.java:153)
      	... 45 more
      

        Attachments

          Issue Links

            Activity

              People

              • Assignee:
                Unassigned
                Reporter:
                adam.antal Adam Antal
              • Votes:
                0 Vote for this issue
                Watchers:
                3 Start watching this issue

                Dates

                • Created:
                  Updated: