Uploaded image for project: 'Hadoop YARN'
  1. Hadoop YARN
  2. YARN-9622

All testcase fails in TestTimelineReaderWebServicesHBaseStorage on branch-3.2

    XMLWordPrintableJSON

    Details

    • Type: Bug
    • Status: Resolved
    • Priority: Major
    • Resolution: Duplicate
    • Affects Version/s: 3.2.0
    • Fix Version/s: None
    • Labels:
      None

      Description

      When you try to run all tests from TestTimelineReaderWebServicesHBaseStorage, the result is the following:

      [ERROR] Failures: 
      [ERROR]   TestTimelineReaderWebServicesHBaseStorage.testGetAppNotPresent:2222->AbstractTimelineReaderHBaseTestBase.verifyHttpResponse:140 Response from server should have been Not Found
      [ERROR]   TestTimelineReaderWebServicesHBaseStorage.testGetFlowRunNotPresent:2192->AbstractTimelineReaderHBaseTestBase.verifyHttpResponse:140 Response from server should have been Not Found
      [ERROR]   TestTimelineReaderWebServicesHBaseStorage.testUIDNotProperlyEscaped:905->AbstractTimelineReaderHBaseTestBase.verifyHttpResponse:140 Response from server should have been Bad Request
      [ERROR] Errors: 
      [ERROR]   TestTimelineReaderWebServicesHBaseStorage.testForFlowAppsPagination:2375->AbstractTimelineReaderHBaseTestBase.getResponse:129 » IO
      [ERROR]   TestTimelineReaderWebServicesHBaseStorage.testForFlowRunAppsPagination:2420->AbstractTimelineReaderHBaseTestBase.getResponse:129 » IO
      [ERROR]   TestTimelineReaderWebServicesHBaseStorage.testForFlowRunsPagination:2465->AbstractTimelineReaderHBaseTestBase.getResponse:129 » IO
      [ERROR]   TestTimelineReaderWebServicesHBaseStorage.testGenericEntitiesForPagination:2272->verifyEntitiesForPagination:2288->AbstractTimelineReaderHBaseTestBase.getResponse:129 » IO
      [ERROR]   TestTimelineReaderWebServicesHBaseStorage.testGetApp:1024->AbstractTimelineReaderHBaseTestBase.getResponse:129 » IO
      [ERROR]   TestTimelineReaderWebServicesHBaseStorage.testGetAppWithoutFlowInfo:1064->AbstractTimelineReaderHBaseTestBase.getResponse:129 » IO
      [ERROR]   TestTimelineReaderWebServicesHBaseStorage.testGetAppsMetricsRange:2516->AbstractTimelineReaderHBaseTestBase.getResponse:129 » IO
      [ERROR]   TestTimelineReaderWebServicesHBaseStorage.testGetEntitiesByUID:662->AbstractTimelineReaderHBaseTestBase.getResponse:129 » IO
      [ERROR]   TestTimelineReaderWebServicesHBaseStorage.testGetEntitiesConfigFilters:1263->AbstractTimelineReaderHBaseTestBase.getResponse:129 » IO
      [ERROR]   TestTimelineReaderWebServicesHBaseStorage.testGetEntitiesDataToRetrieve:1154->AbstractTimelineReaderHBaseTestBase.getResponse:129 » IO
      [ERROR]   TestTimelineReaderWebServicesHBaseStorage.testGetEntitiesEventFilters:1640->AbstractTimelineReaderHBaseTestBase.getResponse:129 » IO
      [ERROR]   TestTimelineReaderWebServicesHBaseStorage.testGetEntitiesInfoFilters:1380->AbstractTimelineReaderHBaseTestBase.getResponse:129 » IO
      [ERROR]   TestTimelineReaderWebServicesHBaseStorage.testGetEntitiesMetricFilters:1494->AbstractTimelineReaderHBaseTestBase.getResponse:129 » IO
      [ERROR]   TestTimelineReaderWebServicesHBaseStorage.testGetEntitiesMetricsTimeRange:1820->AbstractTimelineReaderHBaseTestBase.getResponse:129 » IO
      [ERROR]   TestTimelineReaderWebServicesHBaseStorage.testGetEntitiesRelationFilters:1696->AbstractTimelineReaderHBaseTestBase.getResponse:129 » IO
      [ERROR]   TestTimelineReaderWebServicesHBaseStorage.testGetEntitiesWithoutFlowInfo:1130->AbstractTimelineReaderHBaseTestBase.getResponse:129 » IO
      [ERROR]   TestTimelineReaderWebServicesHBaseStorage.testGetEntityDataToRetrieve:1905->AbstractTimelineReaderHBaseTestBase.getResponse:129 » IO
      [ERROR]   TestTimelineReaderWebServicesHBaseStorage.testGetEntityWithoutFlowInfo:1113->AbstractTimelineReaderHBaseTestBase.getResponse:129 » IO
      [ERROR]   TestTimelineReaderWebServicesHBaseStorage.testGetFlowApps:2047->AbstractTimelineReaderHBaseTestBase.getResponse:129 » IO
      [ERROR]   TestTimelineReaderWebServicesHBaseStorage.testGetFlowAppsFilters:2153->AbstractTimelineReaderHBaseTestBase.getResponse:129 » IO
      [ERROR]   TestTimelineReaderWebServicesHBaseStorage.testGetFlowAppsNotPresent:2253->AbstractTimelineReaderHBaseTestBase.getResponse:129 » IO
      [ERROR]   TestTimelineReaderWebServicesHBaseStorage.testGetFlowRun:443->AbstractTimelineReaderHBaseTestBase.getResponse:129 » IO
      [ERROR]   TestTimelineReaderWebServicesHBaseStorage.testGetFlowRunApps:1984->AbstractTimelineReaderHBaseTestBase.getResponse:129 » IO
      [ERROR]   TestTimelineReaderWebServicesHBaseStorage.testGetFlowRunAppsNotPresent:2235->AbstractTimelineReaderHBaseTestBase.getResponse:129 » IO
      [ERROR]   TestTimelineReaderWebServicesHBaseStorage.testGetFlowRuns:488->AbstractTimelineReaderHBaseTestBase.getResponse:129 » IO
      [ERROR]   TestTimelineReaderWebServicesHBaseStorage.testGetFlowRunsMetricsToRetrieve:616->AbstractTimelineReaderHBaseTestBase.getResponse:129 » IO
      [ERROR]   TestTimelineReaderWebServicesHBaseStorage.testGetFlows:918->verifyFlowEntites:2349->AbstractTimelineReaderHBaseTestBase.getResponse:129 » IO
      [ERROR]   TestTimelineReaderWebServicesHBaseStorage.testGetFlowsForPagination:990->verifyFlowEntites:2349->AbstractTimelineReaderHBaseTestBase.getResponse:129 » IO
      [ERROR]   TestTimelineReaderWebServicesHBaseStorage.testGetFlowsNotPresent:2204->AbstractTimelineReaderHBaseTestBase.getResponse:129 » IO
      [ERROR]   TestTimelineReaderWebServicesHBaseStorage.testUIDQueryWithAndWithoutFlowContextInfo:821->AbstractTimelineReaderHBaseTestBase.getResponse:129 » IO
      [INFO] 
      [ERROR] Tests run: 33, Failures: 3, Errors: 30, Skipped: 0
      

        Attachments

          Issue Links

            Activity

              People

              • Assignee:
                prabhujoseph Prabhu Joseph
                Reporter:
                pbacsko Peter Bacsko
              • Votes:
                0 Vote for this issue
                Watchers:
                3 Start watching this issue

                Dates

                • Created:
                  Updated:
                  Resolved: