Uploaded image for project: 'Hadoop YARN'
  1. Hadoop YARN
  2. YARN-9524

TestAHSWebServices and TestLogsCLI test case failures

    XMLWordPrintableJSON

    Details

      Description

      TestAHSWebServices and TestLogsCLI test case failures after YARN-6929.

      [ERROR] Failures: 
      [ERROR]   TestLogsCLI.testFetchApplictionLogsAsAnotherUser:1014
      [ERROR] Errors: 
      [ERROR]   TestLogsCLI.testFetchFinishedApplictionLogs:420->uploadEmptyContainerLogIntoRemoteDir:1543 » NullPointer
      [INFO] 
      [ERROR] Tests run: 339, Failures: 1, Errors: 1, Skipped: 1
      
      [ERROR] Failures: 
      [ERROR]   TestAHSWebServices.testContainerLogsForFinishedApps:624
      [ERROR]   TestAHSWebServices.testContainerLogsForFinishedApps:624
      [ERROR] Errors: 
      [ERROR]   TestAHSWebServices.testContainerLogsMetaForFinishedApps:942 » WebApplication j...
      [ERROR]   TestAHSWebServices.testContainerLogsMetaForFinishedApps:942 » WebApplication j...

        Attachments

        1. YARN-9524-001.patch
          15 kB
          Prabhu Joseph
        2. YARN-9524-002.patch
          14 kB
          Prabhu Joseph
        3. Redirects_HistoryServer.png
          430 kB
          Prabhu Joseph
        4. RM-Tracking-URL.png
          471 kB
          Prabhu Joseph
        5. Fetches_Logs.png
          642 kB
          Prabhu Joseph

          Issue Links

            Activity

              People

              • Assignee:
                prabhujoseph Prabhu Joseph
                Reporter:
                prabhujoseph Prabhu Joseph
              • Votes:
                0 Vote for this issue
                Watchers:
                4 Start watching this issue

                Dates

                • Created:
                  Updated:
                  Resolved: