Uploaded image for project: 'Hadoop YARN'
  1. Hadoop YARN
  2. YARN-9250

hadoop-yarn-server-nodemanager build failed: make failed with error code 2

    Details

    • Type: Bug
    • Status: Open
    • Priority: Blocker
    • Resolution: Unresolved
    • Affects Version/s: 3.2.0
    • Fix Version/s: None
    • Component/s: nodemanager
    • Labels:
      None

      Description

      when i compile hadoop-3.2.0 release,i encountered the following errors:

      [ERROR] Failed to execute goal org.apache.hadoop:hadoop-maven-plugins:3.2.0:cmake-compile (cmake-compile) on project hadoop-yarn-server-nodemanager: make failed with error code 2 -> [Help 1]
      org.apache.maven.lifecycle.LifecycleExecutionException: Failed to execute goal org.apache.hadoop:hadoop-maven-plugins:3.2.0:cmake-compile (cmake-compile) on project hadoop-yarn-server-nodemanager: make failed with error code 2
      at org.apache.maven.lifecycle.internal.MojoExecutor.execute(MojoExecutor.java:212)
      at org.apache.maven.lifecycle.internal.MojoExecutor.execute(MojoExecutor.java:153)
      at org.apache.maven.lifecycle.internal.MojoExecutor.execute(MojoExecutor.java:145)
      at org.apache.maven.lifecycle.internal.LifecycleModuleBuilder.buildProject(LifecycleModuleBuilder.java:116)
      at org.apache.maven.lifecycle.internal.LifecycleModuleBuilder.buildProject(LifecycleModuleBuilder.java:80)
      at org.apache.maven.lifecycle.internal.builder.singlethreaded.SingleThreadedBuilder.build(SingleThreadedBuilder.java:51)
      at org.apache.maven.lifecycle.internal.LifecycleStarter.execute(LifecycleStarter.java:128)
      at org.apache.maven.DefaultMaven.doExecute(DefaultMaven.java:307)
      at org.apache.maven.DefaultMaven.doExecute(DefaultMaven.java:193)
      at org.apache.maven.DefaultMaven.execute(DefaultMaven.java:106)
      at org.apache.maven.cli.MavenCli.execute(MavenCli.java:863)
      at org.apache.maven.cli.MavenCli.doMain(MavenCli.java:288)
      at org.apache.maven.cli.MavenCli.main(MavenCli.java:199)
      at sun.reflect.NativeMethodAccessorImpl.invoke0(Native Method)
      at sun.reflect.NativeMethodAccessorImpl.invoke(NativeMethodAccessorImpl.java:62)
      at sun.reflect.DelegatingMethodAccessorImpl.invoke(DelegatingMethodAccessorImpl.java:43)
      at java.lang.reflect.Method.invoke(Method.java:498)
      at org.codehaus.plexus.classworlds.launcher.Launcher.launchEnhanced(Launcher.java:289)
      at org.codehaus.plexus.classworlds.launcher.Launcher.launch(Launcher.java:229)
      at org.codehaus.plexus.classworlds.launcher.Launcher.mainWithExitCode(Launcher.java:415)
      at org.codehaus.plexus.classworlds.launcher.Launcher.main(Launcher.java:356)
      Caused by: org.apache.maven.plugin.MojoExecutionException: make failed with error code 2
      at org.apache.hadoop.maven.plugin.cmakebuilder.CompileMojo.runMake(CompileMojo.java:231)
      at org.apache.hadoop.maven.plugin.cmakebuilder.CompileMojo.execute(CompileMojo.java:98)
      at org.apache.maven.plugin.DefaultBuildPluginManager.executeMojo(DefaultBuildPluginManager.java:134)
      at org.apache.maven.lifecycle.internal.MojoExecutor.execute(MojoExecutor.java:207)
      ... 20 more
      [ERROR]
      [ERROR]
      [ERROR] For more information about the errors and possible solutions, please read the following articles:
      [ERROR] [Help 1] http://cwiki.apache.org/confluence/display/MAVEN/MojoExecutionException
      [ERROR]
      [ERROR] After correcting the problems, you can resume the build with the command
      [ERROR] mvn <goals> -rf :hadoop-yarn-server-nodemanager

       

      my compiling environment:

      jdk 1.8.0_181

      maven:3.3.9(/3.6.0)

      cmake version 3.12.0

        Attachments

          Activity

            People

            • Assignee:
              Unassigned
              Reporter:
              linlong charlie mao
            • Votes:
              0 Vote for this issue
              Watchers:
              4 Start watching this issue

              Dates

              • Created:
                Updated: