Uploaded image for project: 'Hadoop YARN'
  1. Hadoop YARN
  2. YARN-7629

TestContainerLaunch# fails after YARN-7381

    Details

    • Type: Bug
    • Status: Resolved
    • Priority: Major
    • Resolution: Fixed
    • Affects Version/s: 3.0.0
    • Fix Version/s: 3.1.0, 3.0.1
    • Component/s: None
    • Labels:
      None
    • Target Version/s:
    • Hadoop Flags:
      Reviewed

      Description

      TestContainerLaunch#testValidEnvVariableSubstitution is failing:

      [INFO] Running org.apache.hadoop.yarn.server.nodemanager.containermanager.launcher.TestContainerLaunch
      [ERROR] Tests run: 1, Failures: 1, Errors: 0, Skipped: 0, Time elapsed: 0.824 s <<< FAILURE! - in org.apache.hadoop.yarn.server.nodemanager.containermanager.launcher.TestContainerLaunch
      [ERROR] testValidEnvVariableSubstitution(org.apache.hadoop.yarn.server.nodemanager.containermanager.launcher.TestContainerLaunch)  Time elapsed: 0.322 s  <<< FAILURE!
      java.lang.AssertionError: Should not catch exception
      	at org.junit.Assert.fail(Assert.java:88)
      	at org.apache.hadoop.yarn.server.nodemanager.containermanager.launcher.TestContainerLaunch.testValidEnvVariableSubstitution(TestContainerLaunch.java:1813)
      	at sun.reflect.NativeMethodAccessorImpl.invoke0(Native Method)
      	at sun.reflect.NativeMethodAccessorImpl.invoke(NativeMethodAccessorImpl.java:62)
      	at sun.reflect.DelegatingMethodAccessorImpl.invoke(DelegatingMethodAccessorImpl.java:43)
      	at java.lang.reflect.Method.invoke(Method.java:497)
      	at org.junit.runners.model.FrameworkMethod$1.runReflectiveCall(FrameworkMethod.java:47)
      	at org.junit.internal.runners.model.ReflectiveCallable.run(ReflectiveCallable.java:12)
      	at org.junit.runners.model.FrameworkMethod.invokeExplosively(FrameworkMethod.java:44)
      	at org.junit.internal.runners.statements.InvokeMethod.evaluate(InvokeMethod.java:17)
      	at org.junit.internal.runners.statements.RunBefores.evaluate(RunBefores.java:26)
      	at org.junit.internal.runners.statements.RunAfters.evaluate(RunAfters.java:27)
      	at org.junit.runners.ParentRunner.runLeaf(ParentRunner.java:271)
      	at org.junit.runners.BlockJUnit4ClassRunner.runChild(BlockJUnit4ClassRunner.java:70)
      	at org.junit.runners.BlockJUnit4ClassRunner.runChild(BlockJUnit4ClassRunner.java:50)
      	at org.junit.runners.ParentRunner$3.run(ParentRunner.java:238)
      	at org.junit.runners.ParentRunner$1.schedule(ParentRunner.java:63)
      	at org.junit.runners.ParentRunner.runChildren(ParentRunner.java:236)
      	at org.junit.runners.ParentRunner.access$000(ParentRunner.java:53)
      	at org.junit.runners.ParentRunner$2.evaluate(ParentRunner.java:229)
      	at org.junit.runners.ParentRunner.run(ParentRunner.java:309)
      	at org.apache.maven.surefire.junit4.JUnit4Provider.execute(JUnit4Provider.java:369)
      	at org.apache.maven.surefire.junit4.JUnit4Provider.executeWithRerun(JUnit4Provider.java:275)
      	at org.apache.maven.surefire.junit4.JUnit4Provider.executeTestSet(JUnit4Provider.java:239)
      	at org.apache.maven.surefire.junit4.JUnit4Provider.invoke(JUnit4Provider.java:160)
      	at org.apache.maven.surefire.booter.ForkedBooter.invokeProviderInSameClassLoader(ForkedBooter.java:373)
      	at org.apache.maven.surefire.booter.ForkedBooter.runSuitesInProcess(ForkedBooter.java:334)
      	at org.apache.maven.surefire.booter.ForkedBooter.execute(ForkedBooter.java:119)
      	at org.apache.maven.surefire.booter.ForkedBooter.main(ForkedBooter.java:407)
      

        Attachments

          Issue Links

            Activity

              People

              • Assignee:
                jlowe Jason Lowe
                Reporter:
                jlowe Jason Lowe
              • Votes:
                0 Vote for this issue
                Watchers:
                3 Start watching this issue

                Dates

                • Created:
                  Updated:
                  Resolved: