Uploaded image for project: 'Hadoop YARN'
  1. Hadoop YARN
  2. YARN-7122

TestReservationSystemInvariants and TestSLSRunner fail

    XMLWordPrintableJSON

    Details

    • Type: Bug
    • Status: Resolved
    • Priority: Major
    • Resolution: Duplicate
    • Affects Version/s: None
    • Fix Version/s: None
    • Component/s: test
    • Labels:
      None

      Description

      Running org.apache.hadoop.yarn.sls.TestReservationSystemInvariants
      Tests run: 2, Failures: 2, Errors: 0, Skipped: 0, Time elapsed: 12.528 sec <<< FAILURE! - in org.apache.hadoop.yarn.sls.TestReservationSystemInvariants
      testSimulatorRunning[Testing with: SYNTH, org.apache.hadoop.yarn.server.resourcemanager.scheduler.capacity.CapacityScheduler, (nodeFile null)](org.apache.hadoop.yarn.sls.TestReservationSystemInvariants)  Time elapsed: 8.845 sec  <<< FAILURE!
      java.lang.AssertionError: TestSLSRunner catched exception from child thread (TaskRunner.Task): [java.lang.reflect.UndeclaredThrowableException, java.lang.reflect.UndeclaredThrowableException, java.lang.reflect.UndeclaredThrowableException, java.lang.reflect.UndeclaredThrowableException, java.lang.reflect.UndeclaredThrowableException, java.lang.reflect.UndeclaredThrowableException]
      	at org.junit.Assert.fail(Assert.java:88)
      	at org.apache.hadoop.yarn.sls.BaseSLSRunnerTest.runSLS(BaseSLSRunnerTest.java:127)
      	at org.apache.hadoop.yarn.sls.TestReservationSystemInvariants.testSimulatorRunning(TestReservationSystemInvariants.java:69)
      

        Attachments

        1. YARN-7122.001.patch
          2 kB
          Akira Ajisaka

          Issue Links

            Activity

              People

              • Assignee:
                aajisaka Akira Ajisaka
                Reporter:
                aajisaka Akira Ajisaka
              • Votes:
                0 Vote for this issue
                Watchers:
                1 Start watching this issue

                Dates

                • Created:
                  Updated:
                  Resolved: