Uploaded image for project: 'Hadoop YARN'
  1. Hadoop YARN
  2. YARN-700

TestInfoBlock fails on Windows because of line ending missmatch

VotersWatch issueWatchersCreate sub-taskLinkCloneUpdate Comment AuthorReplace String in CommentUpdate Comment VisibilityDelete Comments
    XMLWordPrintableJSON

Details

    • Bug
    • Status: Closed
    • Major
    • Resolution: Fixed
    • 2.1.0-beta, 3.0.0-alpha1
    • 2.1.0-beta
    • None
    • None
    • Reviewed

    Description

      Exception:

      Running org.apache.hadoop.yarn.webapp.view.TestInfoBlock
      Tests run: 1, Failures: 1, Errors: 0, Skipped: 0, Time elapsed: 0.962 sec <<< FAILURE!
      testMultilineInfoBlock(org.apache.hadoop.yarn.webapp.view.TestInfoBlock)  Time elapsed: 873 sec  <<< FAILURE!
      java.lang.AssertionError: 
      	at org.junit.Assert.fail(Assert.java:91)
      	at org.junit.Assert.assertTrue(Assert.java:43)
      	at org.junit.Assert.assertTrue(Assert.java:54)
      	at org.apache.hadoop.yarn.webapp.view.TestInfoBlock.testMultilineInfoBlock(TestInfoBlock.java:79)
      	at sun.reflect.NativeMethodAccessorImpl.invoke0(Native Method)
      	at sun.reflect.NativeMethodAccessorImpl.invoke(NativeMethodAccessorImpl.java:39)
      	at sun.reflect.DelegatingMethodAccessorImpl.invoke(DelegatingMethodAccessorImpl.java:25)
      	at java.lang.reflect.Method.invoke(Method.java:597)
      	at org.junit.runners.model.FrameworkMethod$1.runReflectiveCall(FrameworkMethod.java:44)
      	at org.junit.internal.runners.model.ReflectiveCallable.run(ReflectiveCallable.java:15)
      	at org.junit.runners.model.FrameworkMethod.invokeExplosively(FrameworkMethod.java:41)
      	at org.junit.internal.runners.statements.InvokeMethod.evaluate(InvokeMethod.java:20)
      	at org.junit.internal.runners.statements.FailOnTimeout$1.run(FailOnTimeout.java:28)
      

      Attachments

        1. YARN-700.patch
          2 kB
          Ivan Mitic

        Issue Links

        Activity

          This comment will be Viewable by All Users Viewable by All Users
          Cancel

          People

            ivanmi Ivan Mitic
            ivanmi Ivan Mitic
            Votes:
            0 Vote for this issue
            Watchers:
            3 Start watching this issue

            Dates

              Created:
              Updated:
              Resolved:

              Slack

                Issue deployment