Uploaded image for project: 'Hadoop YARN'
  1. Hadoop YARN
  2. YARN-6763

TestProcfsBasedProcessTree#testProcessTree fails in trunk

    XMLWordPrintableJSON

    Details

    • Type: Test
    • Status: Open
    • Priority: Minor
    • Resolution: Unresolved
    • Affects Version/s: None
    • Fix Version/s: None
    • Component/s: None
    • Labels:
      None

      Description

      Tests run: 5, Failures: 1, Errors: 0, Skipped: 0, Time elapsed: 7.949 sec <<< FAILURE! - in org.apache.hadoop.yarn.util.TestProcfsBasedProcessTree
      testProcessTree(org.apache.hadoop.yarn.util.TestProcfsBasedProcessTree)  Time elapsed: 7.119 sec  <<< FAILURE!
      java.lang.AssertionError: Child process owned by init escaped process tree.
      	at org.junit.Assert.fail(Assert.java:88)
      	at org.junit.Assert.assertTrue(Assert.java:41)
      	at org.apache.hadoop.yarn.util.TestProcfsBasedProcessTree.testProcessTree(TestProcfsBasedProcessTree.java:184)
      

        Attachments

          Issue Links

            Activity

              People

              • Assignee:
                nroberts Nathan Roberts
                Reporter:
                bibinchundatt Bibin Chundatt
              • Votes:
                0 Vote for this issue
                Watchers:
                3 Start watching this issue

                Dates

                • Created:
                  Updated: