XMLWordPrintableJSON

    Details

    • Type: Sub-task
    • Status: Resolved
    • Priority: Minor
    • Resolution: Fixed
    • Affects Version/s: YARN-2915
    • Fix Version/s: 2.9.0, 3.0.0-beta1
    • Component/s: federation
    • Labels:
      None
    • Hadoop Flags:
      Reviewed

      Description

      Tests run: 8, Failures: 1, Errors: 0, Skipped: 0, Time elapsed: 8.432 sec <<< FAILURE! - in org.apache.hadoop.yarn.server.federation.policies.router.TestWeightedRandomRouterPolicy
      testClusterChosenWithRightProbability(org.apache.hadoop.yarn.server.federation.policies.router.TestWeightedRandomRouterPolicy) Time elapsed: 7.437 sec <<< FAILURE!
      java.lang.AssertionError: Id sc5 Actual weight: 0.00228 expected weight: 0.0018106138
      at org.junit.Assert.fail(Assert.java:88)
      at org.junit.Assert.assertTrue(Assert.java:41)
      at org.apache.hadoop.yarn.server.federation.policies.router.TestWeightedRandomRouterPolicy.testClusterChosenWithRightProbability(TestWeightedRandomRouterPolicy.java:118)

        Attachments

        1. YARN-6203-YARN-2915.v1.patch
          3 kB
          Carlo Curino
        2. YARN-6203-YARN-2915.v0.patch
          3 kB
          Carlo Curino

          Issue Links

            Activity

              People

              • Assignee:
                curino Carlo Curino
                Reporter:
                botong Botong Huang
              • Votes:
                0 Vote for this issue
                Watchers:
                3 Start watching this issue

                Dates

                • Created:
                  Updated:
                  Resolved: