Uploaded image for project: 'Hadoop YARN'
  1. Hadoop YARN
  2. YARN-4117

End to end unit test with mini YARN cluster for AMRMProxy Service

    Details

    • Target Version/s:
    • Hadoop Flags:
      Reviewed

      Description

      YARN-2884 introduces a proxy between AM and RM. This JIRA proposes an end to end unit test using mini YARN cluster to the AMRMProxy service. This test will validate register, allocate and finish application and token renewal.

      1. YARN-4117.v0.patch
        26 kB
        Giovanni Matteo Fumarola
      2. YARN-4117.v1.patch
        26 kB
        Giovanni Matteo Fumarola
      3. YARN-4117.v2.patch
        30 kB
        Giovanni Matteo Fumarola
      4. YARN-4117.v3.patch
        30 kB
        Giovanni Matteo Fumarola
      5. YARN-4117.v4.patch
        30 kB
        Giovanni Matteo Fumarola
      6. YARN-4117.v5.patch
        30 kB
        Giovanni Matteo Fumarola
      7. RunTestYarnClient.patch
        0.9 kB
        Jian He

        Issue Links

          Activity

          Hide
          jianhe Jian He added a comment -

          committed to branch-2.8 to

          Show
          jianhe Jian He added a comment - committed to branch-2.8 to
          Hide
          hudson Hudson added a comment -

          FAILURE: Integrated in Hadoop-trunk-Commit #9512 (See https://builds.apache.org/job/Hadoop-trunk-Commit/9512/)
          Missing file for YARN-4117. (jianhe: rev 8831b18c65c8a61e400346dc308e068381835357)

          • hadoop-yarn-project/hadoop-yarn/hadoop-yarn-client/src/test/java/org/apache/hadoop/yarn/client/api/impl/TestAMRMProxy.java
          Show
          hudson Hudson added a comment - FAILURE: Integrated in Hadoop-trunk-Commit #9512 (See https://builds.apache.org/job/Hadoop-trunk-Commit/9512/ ) Missing file for YARN-4117 . (jianhe: rev 8831b18c65c8a61e400346dc308e068381835357) hadoop-yarn-project/hadoop-yarn/hadoop-yarn-client/src/test/java/org/apache/hadoop/yarn/client/api/impl/TestAMRMProxy.java
          Hide
          giovanni.fumarola Giovanni Matteo Fumarola added a comment -

          Thanks Jian He and Subru Krishnan to help me on this.

          Show
          giovanni.fumarola Giovanni Matteo Fumarola added a comment - Thanks Jian He and Subru Krishnan to help me on this.
          Hide
          hudson Hudson added a comment -

          FAILURE: Integrated in Hadoop-trunk-Commit #9507 (See https://builds.apache.org/job/Hadoop-trunk-Commit/9507/)
          YARN-4117. End to end unit test with mini YARN cluster for AMRMProxy (jianhe: rev 55ae1439233e8585d624b2872e1e4753ef63eebb)

          • hadoop-yarn-project/hadoop-yarn/hadoop-yarn-server/hadoop-yarn-server-nodemanager/src/main/java/org/apache/hadoop/yarn/server/nodemanager/containermanager/ContainerManagerImpl.java
          • hadoop-yarn-project/hadoop-yarn/hadoop-yarn-server/hadoop-yarn-server-nodemanager/src/main/java/org/apache/hadoop/yarn/server/nodemanager/amrmproxy/DefaultRequestInterceptor.java
          • hadoop-yarn-project/hadoop-yarn/hadoop-yarn-server/hadoop-yarn-server-nodemanager/src/main/java/org/apache/hadoop/yarn/server/nodemanager/amrmproxy/AMRMProxyService.java
          • hadoop-yarn-project/hadoop-yarn/hadoop-yarn-server/hadoop-yarn-server-tests/src/test/java/org/apache/hadoop/yarn/server/MiniYARNCluster.java
          Show
          hudson Hudson added a comment - FAILURE: Integrated in Hadoop-trunk-Commit #9507 (See https://builds.apache.org/job/Hadoop-trunk-Commit/9507/ ) YARN-4117 . End to end unit test with mini YARN cluster for AMRMProxy (jianhe: rev 55ae1439233e8585d624b2872e1e4753ef63eebb) hadoop-yarn-project/hadoop-yarn/hadoop-yarn-server/hadoop-yarn-server-nodemanager/src/main/java/org/apache/hadoop/yarn/server/nodemanager/containermanager/ContainerManagerImpl.java hadoop-yarn-project/hadoop-yarn/hadoop-yarn-server/hadoop-yarn-server-nodemanager/src/main/java/org/apache/hadoop/yarn/server/nodemanager/amrmproxy/DefaultRequestInterceptor.java hadoop-yarn-project/hadoop-yarn/hadoop-yarn-server/hadoop-yarn-server-nodemanager/src/main/java/org/apache/hadoop/yarn/server/nodemanager/amrmproxy/AMRMProxyService.java hadoop-yarn-project/hadoop-yarn/hadoop-yarn-server/hadoop-yarn-server-tests/src/test/java/org/apache/hadoop/yarn/server/MiniYARNCluster.java
          Hide
          jianhe Jian He added a comment -

          The test failures are not related.

          Committed to trunk, branch-2. thanks Giovanni Matteo Fumarola !

          Show
          jianhe Jian He added a comment - The test failures are not related. Committed to trunk, branch-2. thanks Giovanni Matteo Fumarola !
          Hide
          hadoopqa Hadoop QA added a comment -
          -1 overall



          Vote Subsystem Runtime Comment
          0 reexec 0m 11s Docker mode activated.
          +1 @author 0m 0s The patch does not contain any @author tags.
          +1 test4tests 0m 0s The patch appears to include 1 new or modified test files.
          +1 mvninstall 6m 56s trunk passed
          +1 compile 0m 16s trunk passed with JDK v1.8.0_74
          +1 compile 0m 19s trunk passed with JDK v1.7.0_95
          +1 checkstyle 0m 13s trunk passed
          +1 mvnsite 0m 23s trunk passed
          +1 mvneclipse 0m 13s trunk passed
          +1 findbugs 0m 34s trunk passed
          +1 javadoc 0m 15s trunk passed with JDK v1.8.0_74
          +1 javadoc 0m 18s trunk passed with JDK v1.7.0_95
          +1 mvninstall 0m 19s the patch passed
          +1 compile 0m 14s the patch passed with JDK v1.8.0_74
          +1 javac 0m 14s the patch passed
          +1 compile 0m 16s the patch passed with JDK v1.7.0_95
          +1 javac 0m 16s the patch passed
          +1 checkstyle 0m 11s the patch passed
          +1 mvnsite 0m 20s the patch passed
          +1 mvneclipse 0m 10s the patch passed
          -1 whitespace 0m 0s The patch has 1 line(s) that end in whitespace. Use git apply --whitespace=fix.
          +1 findbugs 0m 44s the patch passed
          +1 javadoc 0m 12s the patch passed with JDK v1.8.0_74
          +1 javadoc 0m 15s the patch passed with JDK v1.7.0_95
          -1 unit 63m 18s hadoop-yarn-client in the patch failed with JDK v1.8.0_74.
          -1 unit 63m 33s hadoop-yarn-client in the patch failed with JDK v1.7.0_95.
          -1 asflicense 0m 19s Patch generated 1 ASF License warnings.
          140m 26s



          Reason Tests
          JDK v1.8.0_74 Failed junit tests hadoop.yarn.client.TestGetGroups
          JDK v1.8.0_74 Timed out junit tests org.apache.hadoop.yarn.client.cli.TestYarnCLI
            org.apache.hadoop.yarn.client.api.impl.TestYarnClient
            org.apache.hadoop.yarn.client.api.impl.TestAMRMClient
            org.apache.hadoop.yarn.client.api.impl.TestNMClient
          JDK v1.7.0_95 Failed junit tests hadoop.yarn.client.TestGetGroups
          JDK v1.7.0_95 Timed out junit tests org.apache.hadoop.yarn.client.cli.TestYarnCLI
            org.apache.hadoop.yarn.client.api.impl.TestYarnClient
            org.apache.hadoop.yarn.client.api.impl.TestAMRMClient
            org.apache.hadoop.yarn.client.api.impl.TestNMClient



          Subsystem Report/Notes
          Docker Image:yetus/hadoop:fbe3e86
          JIRA Patch URL https://issues.apache.org/jira/secure/attachment/12795500/RunTestYarnClient.patch
          JIRA Issue YARN-4117
          Optional Tests asflicense compile javac javadoc mvninstall mvnsite unit findbugs checkstyle
          uname Linux 9f77cf1c47a3 3.13.0-36-lowlatency #63-Ubuntu SMP PREEMPT Wed Sep 3 21:56:12 UTC 2014 x86_64 x86_64 x86_64 GNU/Linux
          Build tool maven
          Personality /testptch/hadoop/patchprocess/precommit/personality/provided.sh
          git revision trunk / fde8ac5
          Default Java 1.7.0_95
          Multi-JDK versions /usr/lib/jvm/java-8-oracle:1.8.0_74 /usr/lib/jvm/java-7-openjdk-amd64:1.7.0_95
          findbugs v3.0.0
          whitespace https://builds.apache.org/job/PreCommit-YARN-Build/10881/artifact/patchprocess/whitespace-eol.txt
          unit https://builds.apache.org/job/PreCommit-YARN-Build/10881/artifact/patchprocess/patch-unit-hadoop-yarn-project_hadoop-yarn_hadoop-yarn-client-jdk1.8.0_74.txt
          unit https://builds.apache.org/job/PreCommit-YARN-Build/10881/artifact/patchprocess/patch-unit-hadoop-yarn-project_hadoop-yarn_hadoop-yarn-client-jdk1.7.0_95.txt
          unit test logs https://builds.apache.org/job/PreCommit-YARN-Build/10881/artifact/patchprocess/patch-unit-hadoop-yarn-project_hadoop-yarn_hadoop-yarn-client-jdk1.8.0_74.txt https://builds.apache.org/job/PreCommit-YARN-Build/10881/artifact/patchprocess/patch-unit-hadoop-yarn-project_hadoop-yarn_hadoop-yarn-client-jdk1.7.0_95.txt
          JDK v1.7.0_95 Test Results https://builds.apache.org/job/PreCommit-YARN-Build/10881/testReport/
          asflicense https://builds.apache.org/job/PreCommit-YARN-Build/10881/artifact/patchprocess/patch-asflicense-problems.txt
          modules C: hadoop-yarn-project/hadoop-yarn/hadoop-yarn-client U: hadoop-yarn-project/hadoop-yarn/hadoop-yarn-client
          Console output https://builds.apache.org/job/PreCommit-YARN-Build/10881/console
          Powered by Apache Yetus 0.2.0 http://yetus.apache.org

          This message was automatically generated.

          Show
          hadoopqa Hadoop QA added a comment - -1 overall Vote Subsystem Runtime Comment 0 reexec 0m 11s Docker mode activated. +1 @author 0m 0s The patch does not contain any @author tags. +1 test4tests 0m 0s The patch appears to include 1 new or modified test files. +1 mvninstall 6m 56s trunk passed +1 compile 0m 16s trunk passed with JDK v1.8.0_74 +1 compile 0m 19s trunk passed with JDK v1.7.0_95 +1 checkstyle 0m 13s trunk passed +1 mvnsite 0m 23s trunk passed +1 mvneclipse 0m 13s trunk passed +1 findbugs 0m 34s trunk passed +1 javadoc 0m 15s trunk passed with JDK v1.8.0_74 +1 javadoc 0m 18s trunk passed with JDK v1.7.0_95 +1 mvninstall 0m 19s the patch passed +1 compile 0m 14s the patch passed with JDK v1.8.0_74 +1 javac 0m 14s the patch passed +1 compile 0m 16s the patch passed with JDK v1.7.0_95 +1 javac 0m 16s the patch passed +1 checkstyle 0m 11s the patch passed +1 mvnsite 0m 20s the patch passed +1 mvneclipse 0m 10s the patch passed -1 whitespace 0m 0s The patch has 1 line(s) that end in whitespace. Use git apply --whitespace=fix. +1 findbugs 0m 44s the patch passed +1 javadoc 0m 12s the patch passed with JDK v1.8.0_74 +1 javadoc 0m 15s the patch passed with JDK v1.7.0_95 -1 unit 63m 18s hadoop-yarn-client in the patch failed with JDK v1.8.0_74. -1 unit 63m 33s hadoop-yarn-client in the patch failed with JDK v1.7.0_95. -1 asflicense 0m 19s Patch generated 1 ASF License warnings. 140m 26s Reason Tests JDK v1.8.0_74 Failed junit tests hadoop.yarn.client.TestGetGroups JDK v1.8.0_74 Timed out junit tests org.apache.hadoop.yarn.client.cli.TestYarnCLI   org.apache.hadoop.yarn.client.api.impl.TestYarnClient   org.apache.hadoop.yarn.client.api.impl.TestAMRMClient   org.apache.hadoop.yarn.client.api.impl.TestNMClient JDK v1.7.0_95 Failed junit tests hadoop.yarn.client.TestGetGroups JDK v1.7.0_95 Timed out junit tests org.apache.hadoop.yarn.client.cli.TestYarnCLI   org.apache.hadoop.yarn.client.api.impl.TestYarnClient   org.apache.hadoop.yarn.client.api.impl.TestAMRMClient   org.apache.hadoop.yarn.client.api.impl.TestNMClient Subsystem Report/Notes Docker Image:yetus/hadoop:fbe3e86 JIRA Patch URL https://issues.apache.org/jira/secure/attachment/12795500/RunTestYarnClient.patch JIRA Issue YARN-4117 Optional Tests asflicense compile javac javadoc mvninstall mvnsite unit findbugs checkstyle uname Linux 9f77cf1c47a3 3.13.0-36-lowlatency #63-Ubuntu SMP PREEMPT Wed Sep 3 21:56:12 UTC 2014 x86_64 x86_64 x86_64 GNU/Linux Build tool maven Personality /testptch/hadoop/patchprocess/precommit/personality/provided.sh git revision trunk / fde8ac5 Default Java 1.7.0_95 Multi-JDK versions /usr/lib/jvm/java-8-oracle:1.8.0_74 /usr/lib/jvm/java-7-openjdk-amd64:1.7.0_95 findbugs v3.0.0 whitespace https://builds.apache.org/job/PreCommit-YARN-Build/10881/artifact/patchprocess/whitespace-eol.txt unit https://builds.apache.org/job/PreCommit-YARN-Build/10881/artifact/patchprocess/patch-unit-hadoop-yarn-project_hadoop-yarn_hadoop-yarn-client-jdk1.8.0_74.txt unit https://builds.apache.org/job/PreCommit-YARN-Build/10881/artifact/patchprocess/patch-unit-hadoop-yarn-project_hadoop-yarn_hadoop-yarn-client-jdk1.7.0_95.txt unit test logs https://builds.apache.org/job/PreCommit-YARN-Build/10881/artifact/patchprocess/patch-unit-hadoop-yarn-project_hadoop-yarn_hadoop-yarn-client-jdk1.8.0_74.txt https://builds.apache.org/job/PreCommit-YARN-Build/10881/artifact/patchprocess/patch-unit-hadoop-yarn-project_hadoop-yarn_hadoop-yarn-client-jdk1.7.0_95.txt JDK v1.7.0_95 Test Results https://builds.apache.org/job/PreCommit-YARN-Build/10881/testReport/ asflicense https://builds.apache.org/job/PreCommit-YARN-Build/10881/artifact/patchprocess/patch-asflicense-problems.txt modules C: hadoop-yarn-project/hadoop-yarn/hadoop-yarn-client U: hadoop-yarn-project/hadoop-yarn/hadoop-yarn-client Console output https://builds.apache.org/job/PreCommit-YARN-Build/10881/console Powered by Apache Yetus 0.2.0 http://yetus.apache.org This message was automatically generated.
          Hide
          jianhe Jian He added a comment -

          I submitted a dummy patch to test whether TestYarnClient is failing or not.

          Show
          jianhe Jian He added a comment - I submitted a dummy patch to test whether TestYarnClient is failing or not.
          Hide
          hadoopqa Hadoop QA added a comment -
          -1 overall



          Vote Subsystem Runtime Comment
          0 reexec 0m 21s Docker mode activated.
          +1 @author 0m 0s The patch does not contain any @author tags.
          +1 test4tests 0m 0s The patch appears to include 2 new or modified test files.
          0 mvndep 0m 14s Maven dependency ordering for branch
          +1 mvninstall 9m 34s trunk passed
          +1 compile 3m 18s trunk passed with JDK v1.8.0_74
          +1 compile 2m 39s trunk passed with JDK v1.7.0_95
          +1 checkstyle 0m 40s trunk passed
          +1 mvnsite 1m 21s trunk passed
          +1 mvneclipse 0m 45s trunk passed
          +1 findbugs 2m 17s trunk passed
          +1 javadoc 1m 16s trunk passed with JDK v1.8.0_74
          +1 javadoc 1m 16s trunk passed with JDK v1.7.0_95
          0 mvndep 0m 13s Maven dependency ordering for patch
          +1 mvninstall 1m 20s the patch passed
          +1 compile 3m 37s the patch passed with JDK v1.8.0_74
          +1 javac 3m 37s the patch passed
          +1 compile 2m 46s the patch passed with JDK v1.7.0_95
          +1 javac 2m 46s the patch passed
          -1 checkstyle 0m 38s hadoop-yarn-project/hadoop-yarn: patch generated 3 new + 55 unchanged - 0 fixed = 58 total (was 55)
          +1 mvnsite 1m 23s the patch passed
          +1 mvneclipse 0m 46s the patch passed
          +1 whitespace 0m 0s Patch has no whitespace issues.
          +1 findbugs 3m 0s the patch passed
          +1 javadoc 1m 17s the patch passed with JDK v1.8.0_74
          +1 javadoc 1m 9s the patch passed with JDK v1.7.0_95
          +1 unit 10m 56s hadoop-yarn-server-nodemanager in the patch passed with JDK v1.8.0_74.
          -1 unit 7m 26s hadoop-yarn-server-tests in the patch failed with JDK v1.8.0_74.
          -1 unit 66m 57s hadoop-yarn-client in the patch failed with JDK v1.8.0_74.
          +1 unit 10m 22s hadoop-yarn-server-nodemanager in the patch passed with JDK v1.7.0_95.
          -1 unit 7m 12s hadoop-yarn-server-tests in the patch failed with JDK v1.7.0_95.
          -1 unit 66m 46s hadoop-yarn-client in the patch failed with JDK v1.7.0_95.
          +1 asflicense 0m 22s Patch does not generate ASF License warnings.
          211m 39s



          Reason Tests
          JDK v1.8.0_74 Failed junit tests hadoop.yarn.server.TestContainerManagerSecurity
            hadoop.yarn.server.TestMiniYarnClusterNodeUtilization
            hadoop.yarn.client.TestGetGroups
            hadoop.yarn.client.api.impl.TestAMRMProxy
          JDK v1.8.0_74 Timed out junit tests org.apache.hadoop.yarn.client.cli.TestYarnCLI
            org.apache.hadoop.yarn.client.api.impl.TestYarnClient
            org.apache.hadoop.yarn.client.api.impl.TestAMRMClient
            org.apache.hadoop.yarn.client.api.impl.TestNMClient
          JDK v1.7.0_95 Failed junit tests hadoop.yarn.server.TestContainerManagerSecurity
            hadoop.yarn.server.TestMiniYarnClusterNodeUtilization
            hadoop.yarn.client.TestGetGroups
            hadoop.yarn.client.api.impl.TestAMRMProxy
          JDK v1.7.0_95 Timed out junit tests org.apache.hadoop.yarn.client.cli.TestYarnCLI
            org.apache.hadoop.yarn.client.api.impl.TestYarnClient
            org.apache.hadoop.yarn.client.api.impl.TestAMRMClient
            org.apache.hadoop.yarn.client.api.impl.TestNMClient



          Subsystem Report/Notes
          Docker Image:yetus/hadoop:fbe3e86
          JIRA Patch URL https://issues.apache.org/jira/secure/attachment/12795452/YARN-4117.v5.patch
          JIRA Issue YARN-4117
          Optional Tests asflicense compile javac javadoc mvninstall mvnsite unit findbugs checkstyle
          uname Linux 2852db1c30fe 3.13.0-36-lowlatency #63-Ubuntu SMP PREEMPT Wed Sep 3 21:56:12 UTC 2014 x86_64 x86_64 x86_64 GNU/Linux
          Build tool maven
          Personality /testptch/hadoop/patchprocess/precommit/personality/provided.sh
          git revision trunk / e8fc81f
          Default Java 1.7.0_95
          Multi-JDK versions /usr/lib/jvm/java-8-oracle:1.8.0_74 /usr/lib/jvm/java-7-openjdk-amd64:1.7.0_95
          findbugs v3.0.0
          checkstyle https://builds.apache.org/job/PreCommit-YARN-Build/10878/artifact/patchprocess/diff-checkstyle-hadoop-yarn-project_hadoop-yarn.txt
          unit https://builds.apache.org/job/PreCommit-YARN-Build/10878/artifact/patchprocess/patch-unit-hadoop-yarn-project_hadoop-yarn_hadoop-yarn-server_hadoop-yarn-server-tests-jdk1.8.0_74.txt
          unit https://builds.apache.org/job/PreCommit-YARN-Build/10878/artifact/patchprocess/patch-unit-hadoop-yarn-project_hadoop-yarn_hadoop-yarn-client-jdk1.8.0_74.txt
          unit https://builds.apache.org/job/PreCommit-YARN-Build/10878/artifact/patchprocess/patch-unit-hadoop-yarn-project_hadoop-yarn_hadoop-yarn-server_hadoop-yarn-server-tests-jdk1.7.0_95.txt
          unit https://builds.apache.org/job/PreCommit-YARN-Build/10878/artifact/patchprocess/patch-unit-hadoop-yarn-project_hadoop-yarn_hadoop-yarn-client-jdk1.7.0_95.txt
          unit test logs https://builds.apache.org/job/PreCommit-YARN-Build/10878/artifact/patchprocess/patch-unit-hadoop-yarn-project_hadoop-yarn_hadoop-yarn-server_hadoop-yarn-server-tests-jdk1.8.0_74.txt https://builds.apache.org/job/PreCommit-YARN-Build/10878/artifact/patchprocess/patch-unit-hadoop-yarn-project_hadoop-yarn_hadoop-yarn-client-jdk1.8.0_74.txt https://builds.apache.org/job/PreCommit-YARN-Build/10878/artifact/patchprocess/patch-unit-hadoop-yarn-project_hadoop-yarn_hadoop-yarn-server_hadoop-yarn-server-tests-jdk1.7.0_95.txt https://builds.apache.org/job/PreCommit-YARN-Build/10878/artifact/patchprocess/patch-unit-hadoop-yarn-project_hadoop-yarn_hadoop-yarn-client-jdk1.7.0_95.txt
          JDK v1.7.0_95 Test Results https://builds.apache.org/job/PreCommit-YARN-Build/10878/testReport/
          modules C: hadoop-yarn-project/hadoop-yarn/hadoop-yarn-server/hadoop-yarn-server-nodemanager hadoop-yarn-project/hadoop-yarn/hadoop-yarn-server/hadoop-yarn-server-tests hadoop-yarn-project/hadoop-yarn/hadoop-yarn-client U: hadoop-yarn-project/hadoop-yarn
          Console output https://builds.apache.org/job/PreCommit-YARN-Build/10878/console
          Powered by Apache Yetus 0.2.0 http://yetus.apache.org

          This message was automatically generated.

          Show
          hadoopqa Hadoop QA added a comment - -1 overall Vote Subsystem Runtime Comment 0 reexec 0m 21s Docker mode activated. +1 @author 0m 0s The patch does not contain any @author tags. +1 test4tests 0m 0s The patch appears to include 2 new or modified test files. 0 mvndep 0m 14s Maven dependency ordering for branch +1 mvninstall 9m 34s trunk passed +1 compile 3m 18s trunk passed with JDK v1.8.0_74 +1 compile 2m 39s trunk passed with JDK v1.7.0_95 +1 checkstyle 0m 40s trunk passed +1 mvnsite 1m 21s trunk passed +1 mvneclipse 0m 45s trunk passed +1 findbugs 2m 17s trunk passed +1 javadoc 1m 16s trunk passed with JDK v1.8.0_74 +1 javadoc 1m 16s trunk passed with JDK v1.7.0_95 0 mvndep 0m 13s Maven dependency ordering for patch +1 mvninstall 1m 20s the patch passed +1 compile 3m 37s the patch passed with JDK v1.8.0_74 +1 javac 3m 37s the patch passed +1 compile 2m 46s the patch passed with JDK v1.7.0_95 +1 javac 2m 46s the patch passed -1 checkstyle 0m 38s hadoop-yarn-project/hadoop-yarn: patch generated 3 new + 55 unchanged - 0 fixed = 58 total (was 55) +1 mvnsite 1m 23s the patch passed +1 mvneclipse 0m 46s the patch passed +1 whitespace 0m 0s Patch has no whitespace issues. +1 findbugs 3m 0s the patch passed +1 javadoc 1m 17s the patch passed with JDK v1.8.0_74 +1 javadoc 1m 9s the patch passed with JDK v1.7.0_95 +1 unit 10m 56s hadoop-yarn-server-nodemanager in the patch passed with JDK v1.8.0_74. -1 unit 7m 26s hadoop-yarn-server-tests in the patch failed with JDK v1.8.0_74. -1 unit 66m 57s hadoop-yarn-client in the patch failed with JDK v1.8.0_74. +1 unit 10m 22s hadoop-yarn-server-nodemanager in the patch passed with JDK v1.7.0_95. -1 unit 7m 12s hadoop-yarn-server-tests in the patch failed with JDK v1.7.0_95. -1 unit 66m 46s hadoop-yarn-client in the patch failed with JDK v1.7.0_95. +1 asflicense 0m 22s Patch does not generate ASF License warnings. 211m 39s Reason Tests JDK v1.8.0_74 Failed junit tests hadoop.yarn.server.TestContainerManagerSecurity   hadoop.yarn.server.TestMiniYarnClusterNodeUtilization   hadoop.yarn.client.TestGetGroups   hadoop.yarn.client.api.impl.TestAMRMProxy JDK v1.8.0_74 Timed out junit tests org.apache.hadoop.yarn.client.cli.TestYarnCLI   org.apache.hadoop.yarn.client.api.impl.TestYarnClient   org.apache.hadoop.yarn.client.api.impl.TestAMRMClient   org.apache.hadoop.yarn.client.api.impl.TestNMClient JDK v1.7.0_95 Failed junit tests hadoop.yarn.server.TestContainerManagerSecurity   hadoop.yarn.server.TestMiniYarnClusterNodeUtilization   hadoop.yarn.client.TestGetGroups   hadoop.yarn.client.api.impl.TestAMRMProxy JDK v1.7.0_95 Timed out junit tests org.apache.hadoop.yarn.client.cli.TestYarnCLI   org.apache.hadoop.yarn.client.api.impl.TestYarnClient   org.apache.hadoop.yarn.client.api.impl.TestAMRMClient   org.apache.hadoop.yarn.client.api.impl.TestNMClient Subsystem Report/Notes Docker Image:yetus/hadoop:fbe3e86 JIRA Patch URL https://issues.apache.org/jira/secure/attachment/12795452/YARN-4117.v5.patch JIRA Issue YARN-4117 Optional Tests asflicense compile javac javadoc mvninstall mvnsite unit findbugs checkstyle uname Linux 2852db1c30fe 3.13.0-36-lowlatency #63-Ubuntu SMP PREEMPT Wed Sep 3 21:56:12 UTC 2014 x86_64 x86_64 x86_64 GNU/Linux Build tool maven Personality /testptch/hadoop/patchprocess/precommit/personality/provided.sh git revision trunk / e8fc81f Default Java 1.7.0_95 Multi-JDK versions /usr/lib/jvm/java-8-oracle:1.8.0_74 /usr/lib/jvm/java-7-openjdk-amd64:1.7.0_95 findbugs v3.0.0 checkstyle https://builds.apache.org/job/PreCommit-YARN-Build/10878/artifact/patchprocess/diff-checkstyle-hadoop-yarn-project_hadoop-yarn.txt unit https://builds.apache.org/job/PreCommit-YARN-Build/10878/artifact/patchprocess/patch-unit-hadoop-yarn-project_hadoop-yarn_hadoop-yarn-server_hadoop-yarn-server-tests-jdk1.8.0_74.txt unit https://builds.apache.org/job/PreCommit-YARN-Build/10878/artifact/patchprocess/patch-unit-hadoop-yarn-project_hadoop-yarn_hadoop-yarn-client-jdk1.8.0_74.txt unit https://builds.apache.org/job/PreCommit-YARN-Build/10878/artifact/patchprocess/patch-unit-hadoop-yarn-project_hadoop-yarn_hadoop-yarn-server_hadoop-yarn-server-tests-jdk1.7.0_95.txt unit https://builds.apache.org/job/PreCommit-YARN-Build/10878/artifact/patchprocess/patch-unit-hadoop-yarn-project_hadoop-yarn_hadoop-yarn-client-jdk1.7.0_95.txt unit test logs https://builds.apache.org/job/PreCommit-YARN-Build/10878/artifact/patchprocess/patch-unit-hadoop-yarn-project_hadoop-yarn_hadoop-yarn-server_hadoop-yarn-server-tests-jdk1.8.0_74.txt https://builds.apache.org/job/PreCommit-YARN-Build/10878/artifact/patchprocess/patch-unit-hadoop-yarn-project_hadoop-yarn_hadoop-yarn-client-jdk1.8.0_74.txt https://builds.apache.org/job/PreCommit-YARN-Build/10878/artifact/patchprocess/patch-unit-hadoop-yarn-project_hadoop-yarn_hadoop-yarn-server_hadoop-yarn-server-tests-jdk1.7.0_95.txt https://builds.apache.org/job/PreCommit-YARN-Build/10878/artifact/patchprocess/patch-unit-hadoop-yarn-project_hadoop-yarn_hadoop-yarn-client-jdk1.7.0_95.txt JDK v1.7.0_95 Test Results https://builds.apache.org/job/PreCommit-YARN-Build/10878/testReport/ modules C: hadoop-yarn-project/hadoop-yarn/hadoop-yarn-server/hadoop-yarn-server-nodemanager hadoop-yarn-project/hadoop-yarn/hadoop-yarn-server/hadoop-yarn-server-tests hadoop-yarn-project/hadoop-yarn/hadoop-yarn-client U: hadoop-yarn-project/hadoop-yarn Console output https://builds.apache.org/job/PreCommit-YARN-Build/10878/console Powered by Apache Yetus 0.2.0 http://yetus.apache.org This message was automatically generated.
          Hide
          giovanni.fumarola Giovanni Matteo Fumarola added a comment -

          Attached v5 - Rebase of v4

          Show
          giovanni.fumarola Giovanni Matteo Fumarola added a comment - Attached v5 - Rebase of v4
          Hide
          hadoopqa Hadoop QA added a comment -
          -1 overall



          Vote Subsystem Runtime Comment
          0 reexec 0m 0s Docker mode activated.
          -1 patch 0m 4s YARN-4117 does not apply to trunk. Rebase required? Wrong Branch? See https://wiki.apache.org/hadoop/HowToContribute for help.



          Subsystem Report/Notes
          JIRA Patch URL https://issues.apache.org/jira/secure/attachment/12793613/YARN-4117.v4.patch
          JIRA Issue YARN-4117
          Console output https://builds.apache.org/job/PreCommit-YARN-Build/10869/console
          Powered by Apache Yetus 0.2.0 http://yetus.apache.org

          This message was automatically generated.

          Show
          hadoopqa Hadoop QA added a comment - -1 overall Vote Subsystem Runtime Comment 0 reexec 0m 0s Docker mode activated. -1 patch 0m 4s YARN-4117 does not apply to trunk. Rebase required? Wrong Branch? See https://wiki.apache.org/hadoop/HowToContribute for help. Subsystem Report/Notes JIRA Patch URL https://issues.apache.org/jira/secure/attachment/12793613/YARN-4117.v4.patch JIRA Issue YARN-4117 Console output https://builds.apache.org/job/PreCommit-YARN-Build/10869/console Powered by Apache Yetus 0.2.0 http://yetus.apache.org This message was automatically generated.
          Hide
          giovanni.fumarola Giovanni Matteo Fumarola added a comment -

          All the tests run fine locally, included the new tests in this patch.
          I do not think the changes in YARN-4686 are relative to the TestYarnClient.createApp() failure.
          The problem should be a wrong configuration in Jenkins, that does not allow to execute that code and let it to timeout.

          Show
          giovanni.fumarola Giovanni Matteo Fumarola added a comment - All the tests run fine locally, included the new tests in this patch. I do not think the changes in YARN-4686 are relative to the TestYarnClient.createApp() failure. The problem should be a wrong configuration in Jenkins, that does not allow to execute that code and let it to timeout.
          Hide
          jianhe Jian He added a comment -

          I triggered a new jenkins test run, lets see how it goes.

          Show
          jianhe Jian He added a comment - I triggered a new jenkins test run, lets see how it goes.
          Hide
          eepayne Eric Payne added a comment -

          Giovanni Matteo Fumarola, thanks for bringing this to my attention. However, I don't think the failures are due to the changes in YARN-4686. As Eric Badger points out in YARN-4686,

          TestYarnCLI, TestAMRMClient, TestYarnClient, TestNMClient, and TestGetGroups are failing in multiple recent precommit builds YARN-4117, YARN-4630, YARN-4676.

          Also, when I run all the yarn tests locally, I don't see the above errors.

          For TestGetGroups, I'm not seeing any errors.

          For TestYarnClient, I see an error, but it's different than the ones seen in this JIRA:

            TestYarnClient.testReservationAPIs:1227 org.apache.hadoop.yarn.server.resourcemanager.reservation.exceptions.PlanningException: The request cannot be satisfied
          
          Show
          eepayne Eric Payne added a comment - Giovanni Matteo Fumarola , thanks for bringing this to my attention. However, I don't think the failures are due to the changes in YARN-4686 . As Eric Badger points out in YARN-4686 , TestYarnCLI, TestAMRMClient, TestYarnClient, TestNMClient, and TestGetGroups are failing in multiple recent precommit builds YARN-4117 , YARN-4630 , YARN-4676 . Also, when I run all the yarn tests locally, I don't see the above errors. For TestGetGroups , I'm not seeing any errors. For TestYarnClient , I see an error, but it's different than the ones seen in this JIRA: TestYarnClient.testReservationAPIs:1227 org.apache.hadoop.yarn.server.resourcemanager.reservation.exceptions.PlanningException: The request cannot be satisfied
          Hide
          giovanni.fumarola Giovanni Matteo Fumarola added a comment -

          Hi Jian He,
          I was checking the test result and something weird showed up.

          YARN-4117 Results:

          Tests in error:
          TestAMRMProxy.testAMRMProxyE2E:110->createApp:368 ? test timed out after 6000...
          TestAMRMProxy.testE2ETokenSwap:273->createApp:368 ? test timed out after 6000...
          TestAMRMProxy.testE2ETokenRenewal:204->createApp:368 ? test timed out after 6...
          TestYarnClient.testShouldNotRetryForeverForNonNetworkExceptions:1468 ? test t...
          TestYarnClient.testAMMRTokens:902->createApp:954 ? test timed out after 30000...
          TestGetGroups>GetGroupsTestBase.testMultipleNonExistingUsers:85->GetGroupsTestBase.runTool:119 ? UnknownHost
          TestGetGroups>GetGroupsTestBase.testExistingInterleavedWithNonExistentUsers:95->GetGroupsTestBase.runTool:119 ? UnknownHost
          TestGetGroups>GetGroupsTestBase.testNoUserGiven:53->GetGroupsTestBase.runTool:119 ? UnknownHost
          TestGetGroups>GetGroupsTestBase.testNonExistentUser:76->GetGroupsTestBase.runTool:119 ? UnknownHost
          TestGetGroups>GetGroupsTestBase.testExistingUser:61->GetGroupsTestBase.runTool:119 ? UnknownHost

          YARN-4686 (Resolved) Results:

          Tests in error:
          TestYarnClient.testShouldNotRetryForeverForNonNetworkExceptions:1486 ? test t...
          TestYarnClient.testAMMRTokens:902->createApp:954 ? test timed out after 30000...
          TestGetGroups>GetGroupsTestBase.testMultipleNonExistingUsers:85->GetGroupsTestBase.runTool:119 ? UnknownHost
          TestGetGroups>GetGroupsTestBase.testExistingInterleavedWithNonExistentUsers:95->GetGroupsTestBase.runTool:119 ? UnknownHost
          TestGetGroups>GetGroupsTestBase.testNoUserGiven:53->GetGroupsTestBase.runTool:119 ? UnknownHost
          TestGetGroups>GetGroupsTestBase.testNonExistentUser:76->GetGroupsTestBase.runTool:119 ? UnknownHost
          TestGetGroups>GetGroupsTestBase.testExistingUser:61->GetGroupsTestBase.runTool:119 ? UnknownHost

          TestYarnClient.testAMRMTokens fails in both scenarios when it tries to create an application – it timeouts because it is stuck.
          In TestAMRMProxy I used the same code to create an application.

          Thoughts? /cc Eric Payne committer of YARN-4686

          Show
          giovanni.fumarola Giovanni Matteo Fumarola added a comment - Hi Jian He , I was checking the test result and something weird showed up. YARN-4117 Results: Tests in error: TestAMRMProxy.testAMRMProxyE2E:110-> createApp :368 ? test timed out after 6000... TestAMRMProxy.testE2ETokenSwap:273-> createApp :368 ? test timed out after 6000... TestAMRMProxy.testE2ETokenRenewal:204-> createApp :368 ? test timed out after 6... TestYarnClient.testShouldNotRetryForeverForNonNetworkExceptions:1468 ? test t... TestYarnClient.testAMMRTokens:902-> createApp :954 ? test timed out after 30000... TestGetGroups>GetGroupsTestBase.testMultipleNonExistingUsers:85->GetGroupsTestBase.runTool:119 ? UnknownHost TestGetGroups>GetGroupsTestBase.testExistingInterleavedWithNonExistentUsers:95->GetGroupsTestBase.runTool:119 ? UnknownHost TestGetGroups>GetGroupsTestBase.testNoUserGiven:53->GetGroupsTestBase.runTool:119 ? UnknownHost TestGetGroups>GetGroupsTestBase.testNonExistentUser:76->GetGroupsTestBase.runTool:119 ? UnknownHost TestGetGroups>GetGroupsTestBase.testExistingUser:61->GetGroupsTestBase.runTool:119 ? UnknownHost YARN-4686 ( Resolved ) Results: Tests in error: TestYarnClient.testShouldNotRetryForeverForNonNetworkExceptions:1486 ? test t... TestYarnClient.testAMMRTokens:902-> createApp :954 ? test timed out after 30000... TestGetGroups>GetGroupsTestBase.testMultipleNonExistingUsers:85->GetGroupsTestBase.runTool:119 ? UnknownHost TestGetGroups>GetGroupsTestBase.testExistingInterleavedWithNonExistentUsers:95->GetGroupsTestBase.runTool:119 ? UnknownHost TestGetGroups>GetGroupsTestBase.testNoUserGiven:53->GetGroupsTestBase.runTool:119 ? UnknownHost TestGetGroups>GetGroupsTestBase.testNonExistentUser:76->GetGroupsTestBase.runTool:119 ? UnknownHost TestGetGroups>GetGroupsTestBase.testExistingUser:61->GetGroupsTestBase.runTool:119 ? UnknownHost TestYarnClient.testAMRMTokens fails in both scenarios when it tries to create an application – it timeouts because it is stuck. In TestAMRMProxy I used the same code to create an application. Thoughts? /cc Eric Payne committer of YARN-4686
          Hide
          hadoopqa Hadoop QA added a comment -
          -1 overall



          Vote Subsystem Runtime Comment
          0 reexec 0m 12s Docker mode activated.
          +1 @author 0m 0s The patch does not contain any @author tags.
          +1 test4tests 0m 0s The patch appears to include 2 new or modified test files.
          0 mvndep 0m 11s Maven dependency ordering for branch
          +1 mvninstall 6m 43s trunk passed
          +1 compile 1m 49s trunk passed with JDK v1.8.0_74
          +1 compile 2m 7s trunk passed with JDK v1.7.0_95
          +1 checkstyle 0m 32s trunk passed
          +1 mvnsite 1m 9s trunk passed
          +1 mvneclipse 0m 41s trunk passed
          +1 findbugs 1m 49s trunk passed
          +1 javadoc 0m 45s trunk passed with JDK v1.8.0_74
          +1 javadoc 0m 55s trunk passed with JDK v1.7.0_95
          0 mvndep 0m 10s Maven dependency ordering for patch
          +1 mvninstall 1m 0s the patch passed
          +1 compile 1m 45s the patch passed with JDK v1.8.0_74
          +1 javac 1m 45s the patch passed
          +1 compile 2m 3s the patch passed with JDK v1.7.0_95
          +1 javac 2m 3s the patch passed
          -1 checkstyle 0m 31s hadoop-yarn-project/hadoop-yarn: patch generated 3 new + 55 unchanged - 0 fixed = 58 total (was 55)
          +1 mvnsite 1m 5s the patch passed
          +1 mvneclipse 0m 35s the patch passed
          +1 whitespace 0m 0s Patch has no whitespace issues.
          +1 findbugs 2m 17s the patch passed
          +1 javadoc 0m 39s the patch passed with JDK v1.8.0_74
          +1 javadoc 0m 50s the patch passed with JDK v1.7.0_95
          +1 unit 9m 16s hadoop-yarn-server-nodemanager in the patch passed with JDK v1.8.0_74.
          -1 unit 6m 43s hadoop-yarn-server-tests in the patch failed with JDK v1.8.0_74.
          -1 unit 67m 36s hadoop-yarn-client in the patch failed with JDK v1.8.0_74.
          +1 unit 9m 38s hadoop-yarn-server-nodemanager in the patch passed with JDK v1.7.0_95.
          -1 unit 6m 45s hadoop-yarn-server-tests in the patch failed with JDK v1.7.0_95.
          -1 unit 67m 52s hadoop-yarn-client in the patch failed with JDK v1.7.0_95.
          +1 asflicense 0m 22s Patch does not generate ASF License warnings.
          197m 20s



          Reason Tests
          JDK v1.8.0_74 Failed junit tests hadoop.yarn.server.TestMiniYarnClusterNodeUtilization
            hadoop.yarn.server.TestContainerManagerSecurity
            hadoop.yarn.client.TestGetGroups
            hadoop.yarn.client.api.impl.TestAMRMProxy
          JDK v1.8.0_74 Timed out junit tests org.apache.hadoop.yarn.client.cli.TestYarnCLI
            org.apache.hadoop.yarn.client.api.impl.TestAMRMClient
            org.apache.hadoop.yarn.client.api.impl.TestYarnClient
            org.apache.hadoop.yarn.client.api.impl.TestNMClient
          JDK v1.7.0_95 Failed junit tests hadoop.yarn.server.TestMiniYarnClusterNodeUtilization
            hadoop.yarn.server.TestContainerManagerSecurity
            hadoop.yarn.client.TestGetGroups
            hadoop.yarn.client.api.impl.TestAMRMProxy
          JDK v1.7.0_95 Timed out junit tests org.apache.hadoop.yarn.client.cli.TestYarnCLI
            org.apache.hadoop.yarn.client.api.impl.TestAMRMClient
            org.apache.hadoop.yarn.client.api.impl.TestYarnClient
            org.apache.hadoop.yarn.client.api.impl.TestNMClient



          Subsystem Report/Notes
          Docker Image:yetus/hadoop:0ca8df7
          JIRA Patch URL https://issues.apache.org/jira/secure/attachment/12793613/YARN-4117.v4.patch
          JIRA Issue YARN-4117
          Optional Tests asflicense compile javac javadoc mvninstall mvnsite unit findbugs checkstyle
          uname Linux bcdfbf122e31 3.13.0-36-lowlatency #63-Ubuntu SMP PREEMPT Wed Sep 3 21:56:12 UTC 2014 x86_64 x86_64 x86_64 GNU/Linux
          Build tool maven
          Personality /testptch/hadoop/patchprocess/precommit/personality/provided.sh
          git revision trunk / 5176a69
          Default Java 1.7.0_95
          Multi-JDK versions /usr/lib/jvm/java-8-oracle:1.8.0_74 /usr/lib/jvm/java-7-openjdk-amd64:1.7.0_95
          findbugs v3.0.0
          checkstyle https://builds.apache.org/job/PreCommit-YARN-Build/10793/artifact/patchprocess/diff-checkstyle-hadoop-yarn-project_hadoop-yarn.txt
          unit https://builds.apache.org/job/PreCommit-YARN-Build/10793/artifact/patchprocess/patch-unit-hadoop-yarn-project_hadoop-yarn_hadoop-yarn-server_hadoop-yarn-server-tests-jdk1.8.0_74.txt
          unit https://builds.apache.org/job/PreCommit-YARN-Build/10793/artifact/patchprocess/patch-unit-hadoop-yarn-project_hadoop-yarn_hadoop-yarn-client-jdk1.8.0_74.txt
          unit https://builds.apache.org/job/PreCommit-YARN-Build/10793/artifact/patchprocess/patch-unit-hadoop-yarn-project_hadoop-yarn_hadoop-yarn-server_hadoop-yarn-server-tests-jdk1.7.0_95.txt
          unit https://builds.apache.org/job/PreCommit-YARN-Build/10793/artifact/patchprocess/patch-unit-hadoop-yarn-project_hadoop-yarn_hadoop-yarn-client-jdk1.7.0_95.txt
          unit test logs https://builds.apache.org/job/PreCommit-YARN-Build/10793/artifact/patchprocess/patch-unit-hadoop-yarn-project_hadoop-yarn_hadoop-yarn-server_hadoop-yarn-server-tests-jdk1.8.0_74.txt https://builds.apache.org/job/PreCommit-YARN-Build/10793/artifact/patchprocess/patch-unit-hadoop-yarn-project_hadoop-yarn_hadoop-yarn-client-jdk1.8.0_74.txt https://builds.apache.org/job/PreCommit-YARN-Build/10793/artifact/patchprocess/patch-unit-hadoop-yarn-project_hadoop-yarn_hadoop-yarn-server_hadoop-yarn-server-tests-jdk1.7.0_95.txt https://builds.apache.org/job/PreCommit-YARN-Build/10793/artifact/patchprocess/patch-unit-hadoop-yarn-project_hadoop-yarn_hadoop-yarn-client-jdk1.7.0_95.txt
          JDK v1.7.0_95 Test Results https://builds.apache.org/job/PreCommit-YARN-Build/10793/testReport/
          modules C: hadoop-yarn-project/hadoop-yarn/hadoop-yarn-server/hadoop-yarn-server-nodemanager hadoop-yarn-project/hadoop-yarn/hadoop-yarn-server/hadoop-yarn-server-tests hadoop-yarn-project/hadoop-yarn/hadoop-yarn-client U: hadoop-yarn-project/hadoop-yarn
          Console output https://builds.apache.org/job/PreCommit-YARN-Build/10793/console
          Powered by Apache Yetus 0.2.0 http://yetus.apache.org

          This message was automatically generated.

          Show
          hadoopqa Hadoop QA added a comment - -1 overall Vote Subsystem Runtime Comment 0 reexec 0m 12s Docker mode activated. +1 @author 0m 0s The patch does not contain any @author tags. +1 test4tests 0m 0s The patch appears to include 2 new or modified test files. 0 mvndep 0m 11s Maven dependency ordering for branch +1 mvninstall 6m 43s trunk passed +1 compile 1m 49s trunk passed with JDK v1.8.0_74 +1 compile 2m 7s trunk passed with JDK v1.7.0_95 +1 checkstyle 0m 32s trunk passed +1 mvnsite 1m 9s trunk passed +1 mvneclipse 0m 41s trunk passed +1 findbugs 1m 49s trunk passed +1 javadoc 0m 45s trunk passed with JDK v1.8.0_74 +1 javadoc 0m 55s trunk passed with JDK v1.7.0_95 0 mvndep 0m 10s Maven dependency ordering for patch +1 mvninstall 1m 0s the patch passed +1 compile 1m 45s the patch passed with JDK v1.8.0_74 +1 javac 1m 45s the patch passed +1 compile 2m 3s the patch passed with JDK v1.7.0_95 +1 javac 2m 3s the patch passed -1 checkstyle 0m 31s hadoop-yarn-project/hadoop-yarn: patch generated 3 new + 55 unchanged - 0 fixed = 58 total (was 55) +1 mvnsite 1m 5s the patch passed +1 mvneclipse 0m 35s the patch passed +1 whitespace 0m 0s Patch has no whitespace issues. +1 findbugs 2m 17s the patch passed +1 javadoc 0m 39s the patch passed with JDK v1.8.0_74 +1 javadoc 0m 50s the patch passed with JDK v1.7.0_95 +1 unit 9m 16s hadoop-yarn-server-nodemanager in the patch passed with JDK v1.8.0_74. -1 unit 6m 43s hadoop-yarn-server-tests in the patch failed with JDK v1.8.0_74. -1 unit 67m 36s hadoop-yarn-client in the patch failed with JDK v1.8.0_74. +1 unit 9m 38s hadoop-yarn-server-nodemanager in the patch passed with JDK v1.7.0_95. -1 unit 6m 45s hadoop-yarn-server-tests in the patch failed with JDK v1.7.0_95. -1 unit 67m 52s hadoop-yarn-client in the patch failed with JDK v1.7.0_95. +1 asflicense 0m 22s Patch does not generate ASF License warnings. 197m 20s Reason Tests JDK v1.8.0_74 Failed junit tests hadoop.yarn.server.TestMiniYarnClusterNodeUtilization   hadoop.yarn.server.TestContainerManagerSecurity   hadoop.yarn.client.TestGetGroups   hadoop.yarn.client.api.impl.TestAMRMProxy JDK v1.8.0_74 Timed out junit tests org.apache.hadoop.yarn.client.cli.TestYarnCLI   org.apache.hadoop.yarn.client.api.impl.TestAMRMClient   org.apache.hadoop.yarn.client.api.impl.TestYarnClient   org.apache.hadoop.yarn.client.api.impl.TestNMClient JDK v1.7.0_95 Failed junit tests hadoop.yarn.server.TestMiniYarnClusterNodeUtilization   hadoop.yarn.server.TestContainerManagerSecurity   hadoop.yarn.client.TestGetGroups   hadoop.yarn.client.api.impl.TestAMRMProxy JDK v1.7.0_95 Timed out junit tests org.apache.hadoop.yarn.client.cli.TestYarnCLI   org.apache.hadoop.yarn.client.api.impl.TestAMRMClient   org.apache.hadoop.yarn.client.api.impl.TestYarnClient   org.apache.hadoop.yarn.client.api.impl.TestNMClient Subsystem Report/Notes Docker Image:yetus/hadoop:0ca8df7 JIRA Patch URL https://issues.apache.org/jira/secure/attachment/12793613/YARN-4117.v4.patch JIRA Issue YARN-4117 Optional Tests asflicense compile javac javadoc mvninstall mvnsite unit findbugs checkstyle uname Linux bcdfbf122e31 3.13.0-36-lowlatency #63-Ubuntu SMP PREEMPT Wed Sep 3 21:56:12 UTC 2014 x86_64 x86_64 x86_64 GNU/Linux Build tool maven Personality /testptch/hadoop/patchprocess/precommit/personality/provided.sh git revision trunk / 5176a69 Default Java 1.7.0_95 Multi-JDK versions /usr/lib/jvm/java-8-oracle:1.8.0_74 /usr/lib/jvm/java-7-openjdk-amd64:1.7.0_95 findbugs v3.0.0 checkstyle https://builds.apache.org/job/PreCommit-YARN-Build/10793/artifact/patchprocess/diff-checkstyle-hadoop-yarn-project_hadoop-yarn.txt unit https://builds.apache.org/job/PreCommit-YARN-Build/10793/artifact/patchprocess/patch-unit-hadoop-yarn-project_hadoop-yarn_hadoop-yarn-server_hadoop-yarn-server-tests-jdk1.8.0_74.txt unit https://builds.apache.org/job/PreCommit-YARN-Build/10793/artifact/patchprocess/patch-unit-hadoop-yarn-project_hadoop-yarn_hadoop-yarn-client-jdk1.8.0_74.txt unit https://builds.apache.org/job/PreCommit-YARN-Build/10793/artifact/patchprocess/patch-unit-hadoop-yarn-project_hadoop-yarn_hadoop-yarn-server_hadoop-yarn-server-tests-jdk1.7.0_95.txt unit https://builds.apache.org/job/PreCommit-YARN-Build/10793/artifact/patchprocess/patch-unit-hadoop-yarn-project_hadoop-yarn_hadoop-yarn-client-jdk1.7.0_95.txt unit test logs https://builds.apache.org/job/PreCommit-YARN-Build/10793/artifact/patchprocess/patch-unit-hadoop-yarn-project_hadoop-yarn_hadoop-yarn-server_hadoop-yarn-server-tests-jdk1.8.0_74.txt https://builds.apache.org/job/PreCommit-YARN-Build/10793/artifact/patchprocess/patch-unit-hadoop-yarn-project_hadoop-yarn_hadoop-yarn-client-jdk1.8.0_74.txt https://builds.apache.org/job/PreCommit-YARN-Build/10793/artifact/patchprocess/patch-unit-hadoop-yarn-project_hadoop-yarn_hadoop-yarn-server_hadoop-yarn-server-tests-jdk1.7.0_95.txt https://builds.apache.org/job/PreCommit-YARN-Build/10793/artifact/patchprocess/patch-unit-hadoop-yarn-project_hadoop-yarn_hadoop-yarn-client-jdk1.7.0_95.txt JDK v1.7.0_95 Test Results https://builds.apache.org/job/PreCommit-YARN-Build/10793/testReport/ modules C: hadoop-yarn-project/hadoop-yarn/hadoop-yarn-server/hadoop-yarn-server-nodemanager hadoop-yarn-project/hadoop-yarn/hadoop-yarn-server/hadoop-yarn-server-tests hadoop-yarn-project/hadoop-yarn/hadoop-yarn-client U: hadoop-yarn-project/hadoop-yarn Console output https://builds.apache.org/job/PreCommit-YARN-Build/10793/console Powered by Apache Yetus 0.2.0 http://yetus.apache.org This message was automatically generated.
          Hide
          hadoopqa Hadoop QA added a comment -
          -1 overall



          Vote Subsystem Runtime Comment
          0 reexec 0m 20s Docker mode activated.
          +1 @author 0m 0s The patch does not contain any @author tags.
          +1 test4tests 0m 0s The patch appears to include 2 new or modified test files.
          0 mvndep 0m 10s Maven dependency ordering for branch
          +1 mvninstall 7m 27s trunk passed
          +1 compile 2m 38s trunk passed with JDK v1.8.0_74
          +1 compile 2m 28s trunk passed with JDK v1.7.0_95
          +1 checkstyle 0m 36s trunk passed
          +1 mvnsite 1m 16s trunk passed
          +1 mvneclipse 0m 43s trunk passed
          +1 findbugs 2m 1s trunk passed
          +1 javadoc 0m 59s trunk passed with JDK v1.8.0_74
          +1 javadoc 0m 56s trunk passed with JDK v1.7.0_95
          0 mvndep 0m 10s Maven dependency ordering for patch
          +1 mvninstall 1m 4s the patch passed
          +1 compile 2m 37s the patch passed with JDK v1.8.0_74
          +1 javac 2m 37s the patch passed
          +1 compile 2m 18s the patch passed with JDK v1.7.0_95
          +1 javac 2m 18s the patch passed
          -1 checkstyle 0m 31s hadoop-yarn-project/hadoop-yarn: patch generated 3 new + 55 unchanged - 0 fixed = 58 total (was 55)
          +1 mvnsite 1m 8s the patch passed
          +1 mvneclipse 0m 34s the patch passed
          +1 whitespace 0m 0s Patch has no whitespace issues.
          +1 findbugs 2m 31s the patch passed
          +1 javadoc 0m 54s the patch passed with JDK v1.8.0_74
          +1 javadoc 0m 52s the patch passed with JDK v1.7.0_95
          +1 unit 9m 59s hadoop-yarn-server-nodemanager in the patch passed with JDK v1.8.0_74.
          -1 unit 7m 13s hadoop-yarn-server-tests in the patch failed with JDK v1.8.0_74.
          -1 unit 67m 51s hadoop-yarn-client in the patch failed with JDK v1.8.0_74.
          +1 unit 9m 55s hadoop-yarn-server-nodemanager in the patch passed with JDK v1.7.0_95.
          -1 unit 7m 10s hadoop-yarn-server-tests in the patch failed with JDK v1.7.0_95.
          -1 unit 67m 54s hadoop-yarn-client in the patch failed with JDK v1.7.0_95.
          +1 asflicense 0m 20s Patch does not generate ASF License warnings.
          204m 4s



          Reason Tests
          JDK v1.8.0_74 Failed junit tests hadoop.yarn.server.TestContainerManagerSecurity
            hadoop.yarn.server.TestMiniYarnClusterNodeUtilization
            hadoop.yarn.client.TestGetGroups
            hadoop.yarn.client.api.impl.TestAMRMProxy
          JDK v1.8.0_74 Timed out junit tests org.apache.hadoop.yarn.client.cli.TestYarnCLI
            org.apache.hadoop.yarn.client.api.impl.TestYarnClient
            org.apache.hadoop.yarn.client.api.impl.TestAMRMClient
            org.apache.hadoop.yarn.client.api.impl.TestNMClient
          JDK v1.7.0_95 Failed junit tests hadoop.yarn.server.TestContainerManagerSecurity
            hadoop.yarn.server.TestMiniYarnClusterNodeUtilization
            hadoop.yarn.client.TestGetGroups
            hadoop.yarn.client.api.impl.TestAMRMProxy
          JDK v1.7.0_95 Timed out junit tests org.apache.hadoop.yarn.client.cli.TestYarnCLI
            org.apache.hadoop.yarn.client.api.impl.TestYarnClient
            org.apache.hadoop.yarn.client.api.impl.TestAMRMClient
            org.apache.hadoop.yarn.client.api.impl.TestNMClient



          Subsystem Report/Notes
          Docker Image:yetus/hadoop:0ca8df7
          JIRA Patch URL https://issues.apache.org/jira/secure/attachment/12793613/YARN-4117.v4.patch
          JIRA Issue YARN-4117
          Optional Tests asflicense compile javac javadoc mvninstall mvnsite unit findbugs checkstyle
          uname Linux ea30b1d41af7 3.13.0-36-lowlatency #63-Ubuntu SMP PREEMPT Wed Sep 3 21:56:12 UTC 2014 x86_64 x86_64 x86_64 GNU/Linux
          Build tool maven
          Personality /testptch/hadoop/patchprocess/precommit/personality/provided.sh
          git revision trunk / 5176a69
          Default Java 1.7.0_95
          Multi-JDK versions /usr/lib/jvm/java-8-oracle:1.8.0_74 /usr/lib/jvm/java-7-openjdk-amd64:1.7.0_95
          findbugs v3.0.0
          checkstyle https://builds.apache.org/job/PreCommit-YARN-Build/10791/artifact/patchprocess/diff-checkstyle-hadoop-yarn-project_hadoop-yarn.txt
          unit https://builds.apache.org/job/PreCommit-YARN-Build/10791/artifact/patchprocess/patch-unit-hadoop-yarn-project_hadoop-yarn_hadoop-yarn-server_hadoop-yarn-server-tests-jdk1.8.0_74.txt
          unit https://builds.apache.org/job/PreCommit-YARN-Build/10791/artifact/patchprocess/patch-unit-hadoop-yarn-project_hadoop-yarn_hadoop-yarn-client-jdk1.8.0_74.txt
          unit https://builds.apache.org/job/PreCommit-YARN-Build/10791/artifact/patchprocess/patch-unit-hadoop-yarn-project_hadoop-yarn_hadoop-yarn-server_hadoop-yarn-server-tests-jdk1.7.0_95.txt
          unit https://builds.apache.org/job/PreCommit-YARN-Build/10791/artifact/patchprocess/patch-unit-hadoop-yarn-project_hadoop-yarn_hadoop-yarn-client-jdk1.7.0_95.txt
          unit test logs https://builds.apache.org/job/PreCommit-YARN-Build/10791/artifact/patchprocess/patch-unit-hadoop-yarn-project_hadoop-yarn_hadoop-yarn-server_hadoop-yarn-server-tests-jdk1.8.0_74.txt https://builds.apache.org/job/PreCommit-YARN-Build/10791/artifact/patchprocess/patch-unit-hadoop-yarn-project_hadoop-yarn_hadoop-yarn-client-jdk1.8.0_74.txt https://builds.apache.org/job/PreCommit-YARN-Build/10791/artifact/patchprocess/patch-unit-hadoop-yarn-project_hadoop-yarn_hadoop-yarn-server_hadoop-yarn-server-tests-jdk1.7.0_95.txt https://builds.apache.org/job/PreCommit-YARN-Build/10791/artifact/patchprocess/patch-unit-hadoop-yarn-project_hadoop-yarn_hadoop-yarn-client-jdk1.7.0_95.txt
          JDK v1.7.0_95 Test Results https://builds.apache.org/job/PreCommit-YARN-Build/10791/testReport/
          modules C: hadoop-yarn-project/hadoop-yarn/hadoop-yarn-server/hadoop-yarn-server-nodemanager hadoop-yarn-project/hadoop-yarn/hadoop-yarn-server/hadoop-yarn-server-tests hadoop-yarn-project/hadoop-yarn/hadoop-yarn-client U: hadoop-yarn-project/hadoop-yarn
          Console output https://builds.apache.org/job/PreCommit-YARN-Build/10791/console
          Powered by Apache Yetus 0.2.0 http://yetus.apache.org

          This message was automatically generated.

          Show
          hadoopqa Hadoop QA added a comment - -1 overall Vote Subsystem Runtime Comment 0 reexec 0m 20s Docker mode activated. +1 @author 0m 0s The patch does not contain any @author tags. +1 test4tests 0m 0s The patch appears to include 2 new or modified test files. 0 mvndep 0m 10s Maven dependency ordering for branch +1 mvninstall 7m 27s trunk passed +1 compile 2m 38s trunk passed with JDK v1.8.0_74 +1 compile 2m 28s trunk passed with JDK v1.7.0_95 +1 checkstyle 0m 36s trunk passed +1 mvnsite 1m 16s trunk passed +1 mvneclipse 0m 43s trunk passed +1 findbugs 2m 1s trunk passed +1 javadoc 0m 59s trunk passed with JDK v1.8.0_74 +1 javadoc 0m 56s trunk passed with JDK v1.7.0_95 0 mvndep 0m 10s Maven dependency ordering for patch +1 mvninstall 1m 4s the patch passed +1 compile 2m 37s the patch passed with JDK v1.8.0_74 +1 javac 2m 37s the patch passed +1 compile 2m 18s the patch passed with JDK v1.7.0_95 +1 javac 2m 18s the patch passed -1 checkstyle 0m 31s hadoop-yarn-project/hadoop-yarn: patch generated 3 new + 55 unchanged - 0 fixed = 58 total (was 55) +1 mvnsite 1m 8s the patch passed +1 mvneclipse 0m 34s the patch passed +1 whitespace 0m 0s Patch has no whitespace issues. +1 findbugs 2m 31s the patch passed +1 javadoc 0m 54s the patch passed with JDK v1.8.0_74 +1 javadoc 0m 52s the patch passed with JDK v1.7.0_95 +1 unit 9m 59s hadoop-yarn-server-nodemanager in the patch passed with JDK v1.8.0_74. -1 unit 7m 13s hadoop-yarn-server-tests in the patch failed with JDK v1.8.0_74. -1 unit 67m 51s hadoop-yarn-client in the patch failed with JDK v1.8.0_74. +1 unit 9m 55s hadoop-yarn-server-nodemanager in the patch passed with JDK v1.7.0_95. -1 unit 7m 10s hadoop-yarn-server-tests in the patch failed with JDK v1.7.0_95. -1 unit 67m 54s hadoop-yarn-client in the patch failed with JDK v1.7.0_95. +1 asflicense 0m 20s Patch does not generate ASF License warnings. 204m 4s Reason Tests JDK v1.8.0_74 Failed junit tests hadoop.yarn.server.TestContainerManagerSecurity   hadoop.yarn.server.TestMiniYarnClusterNodeUtilization   hadoop.yarn.client.TestGetGroups   hadoop.yarn.client.api.impl.TestAMRMProxy JDK v1.8.0_74 Timed out junit tests org.apache.hadoop.yarn.client.cli.TestYarnCLI   org.apache.hadoop.yarn.client.api.impl.TestYarnClient   org.apache.hadoop.yarn.client.api.impl.TestAMRMClient   org.apache.hadoop.yarn.client.api.impl.TestNMClient JDK v1.7.0_95 Failed junit tests hadoop.yarn.server.TestContainerManagerSecurity   hadoop.yarn.server.TestMiniYarnClusterNodeUtilization   hadoop.yarn.client.TestGetGroups   hadoop.yarn.client.api.impl.TestAMRMProxy JDK v1.7.0_95 Timed out junit tests org.apache.hadoop.yarn.client.cli.TestYarnCLI   org.apache.hadoop.yarn.client.api.impl.TestYarnClient   org.apache.hadoop.yarn.client.api.impl.TestAMRMClient   org.apache.hadoop.yarn.client.api.impl.TestNMClient Subsystem Report/Notes Docker Image:yetus/hadoop:0ca8df7 JIRA Patch URL https://issues.apache.org/jira/secure/attachment/12793613/YARN-4117.v4.patch JIRA Issue YARN-4117 Optional Tests asflicense compile javac javadoc mvninstall mvnsite unit findbugs checkstyle uname Linux ea30b1d41af7 3.13.0-36-lowlatency #63-Ubuntu SMP PREEMPT Wed Sep 3 21:56:12 UTC 2014 x86_64 x86_64 x86_64 GNU/Linux Build tool maven Personality /testptch/hadoop/patchprocess/precommit/personality/provided.sh git revision trunk / 5176a69 Default Java 1.7.0_95 Multi-JDK versions /usr/lib/jvm/java-8-oracle:1.8.0_74 /usr/lib/jvm/java-7-openjdk-amd64:1.7.0_95 findbugs v3.0.0 checkstyle https://builds.apache.org/job/PreCommit-YARN-Build/10791/artifact/patchprocess/diff-checkstyle-hadoop-yarn-project_hadoop-yarn.txt unit https://builds.apache.org/job/PreCommit-YARN-Build/10791/artifact/patchprocess/patch-unit-hadoop-yarn-project_hadoop-yarn_hadoop-yarn-server_hadoop-yarn-server-tests-jdk1.8.0_74.txt unit https://builds.apache.org/job/PreCommit-YARN-Build/10791/artifact/patchprocess/patch-unit-hadoop-yarn-project_hadoop-yarn_hadoop-yarn-client-jdk1.8.0_74.txt unit https://builds.apache.org/job/PreCommit-YARN-Build/10791/artifact/patchprocess/patch-unit-hadoop-yarn-project_hadoop-yarn_hadoop-yarn-server_hadoop-yarn-server-tests-jdk1.7.0_95.txt unit https://builds.apache.org/job/PreCommit-YARN-Build/10791/artifact/patchprocess/patch-unit-hadoop-yarn-project_hadoop-yarn_hadoop-yarn-client-jdk1.7.0_95.txt unit test logs https://builds.apache.org/job/PreCommit-YARN-Build/10791/artifact/patchprocess/patch-unit-hadoop-yarn-project_hadoop-yarn_hadoop-yarn-server_hadoop-yarn-server-tests-jdk1.8.0_74.txt https://builds.apache.org/job/PreCommit-YARN-Build/10791/artifact/patchprocess/patch-unit-hadoop-yarn-project_hadoop-yarn_hadoop-yarn-client-jdk1.8.0_74.txt https://builds.apache.org/job/PreCommit-YARN-Build/10791/artifact/patchprocess/patch-unit-hadoop-yarn-project_hadoop-yarn_hadoop-yarn-server_hadoop-yarn-server-tests-jdk1.7.0_95.txt https://builds.apache.org/job/PreCommit-YARN-Build/10791/artifact/patchprocess/patch-unit-hadoop-yarn-project_hadoop-yarn_hadoop-yarn-client-jdk1.7.0_95.txt JDK v1.7.0_95 Test Results https://builds.apache.org/job/PreCommit-YARN-Build/10791/testReport/ modules C: hadoop-yarn-project/hadoop-yarn/hadoop-yarn-server/hadoop-yarn-server-nodemanager hadoop-yarn-project/hadoop-yarn/hadoop-yarn-server/hadoop-yarn-server-tests hadoop-yarn-project/hadoop-yarn/hadoop-yarn-client U: hadoop-yarn-project/hadoop-yarn Console output https://builds.apache.org/job/PreCommit-YARN-Build/10791/console Powered by Apache Yetus 0.2.0 http://yetus.apache.org This message was automatically generated.
          Hide
          giovanni.fumarola Giovanni Matteo Fumarola added a comment -

          Increase the timeout for the tests.

          Show
          giovanni.fumarola Giovanni Matteo Fumarola added a comment - Increase the timeout for the tests.
          Hide
          hadoopqa Hadoop QA added a comment -
          -1 overall



          Vote Subsystem Runtime Comment
          0 reexec 0m 15s Docker mode activated.
          +1 @author 0m 0s The patch does not contain any @author tags.
          +1 test4tests 0m 0s The patch appears to include 2 new or modified test files.
          0 mvndep 0m 24s Maven dependency ordering for branch
          +1 mvninstall 6m 47s trunk passed
          +1 compile 1m 46s trunk passed with JDK v1.8.0_74
          +1 compile 2m 6s trunk passed with JDK v1.7.0_95
          +1 checkstyle 0m 33s trunk passed
          +1 mvnsite 1m 13s trunk passed
          +1 mvneclipse 0m 41s trunk passed
          +1 findbugs 1m 50s trunk passed
          +1 javadoc 0m 45s trunk passed with JDK v1.8.0_74
          +1 javadoc 0m 54s trunk passed with JDK v1.7.0_95
          0 mvndep 0m 10s Maven dependency ordering for patch
          +1 mvninstall 1m 0s the patch passed
          +1 compile 1m 42s the patch passed with JDK v1.8.0_74
          +1 javac 1m 42s the patch passed
          +1 compile 2m 3s the patch passed with JDK v1.7.0_95
          +1 javac 2m 3s the patch passed
          -1 checkstyle 0m 31s hadoop-yarn-project/hadoop-yarn: patch generated 3 new + 54 unchanged - 0 fixed = 57 total (was 54)
          +1 mvnsite 1m 6s the patch passed
          +1 mvneclipse 0m 34s the patch passed
          +1 whitespace 0m 0s Patch has no whitespace issues.
          +1 findbugs 2m 19s the patch passed
          +1 javadoc 0m 41s the patch passed with JDK v1.8.0_74
          +1 javadoc 0m 50s the patch passed with JDK v1.7.0_95
          +1 unit 9m 9s hadoop-yarn-server-nodemanager in the patch passed with JDK v1.8.0_74.
          -1 unit 7m 7s hadoop-yarn-server-tests in the patch failed with JDK v1.8.0_74.
          -1 unit 66m 6s hadoop-yarn-client in the patch failed with JDK v1.8.0_74.
          +1 unit 10m 14s hadoop-yarn-server-nodemanager in the patch passed with JDK v1.7.0_95.
          -1 unit 7m 23s hadoop-yarn-server-tests in the patch failed with JDK v1.7.0_95.
          -1 unit 66m 22s hadoop-yarn-client in the patch failed with JDK v1.7.0_95.
          +1 asflicense 0m 20s Patch does not generate ASF License warnings.
          196m 11s



          Reason Tests
          JDK v1.8.0_74 Failed junit tests hadoop.yarn.server.TestContainerManagerSecurity
            hadoop.yarn.server.TestMiniYarnClusterNodeUtilization
            hadoop.yarn.client.api.impl.TestAMRMProxy
            hadoop.yarn.client.TestGetGroups
          JDK v1.8.0_74 Timed out junit tests org.apache.hadoop.yarn.client.cli.TestYarnCLI
            org.apache.hadoop.yarn.client.api.impl.TestYarnClient
            org.apache.hadoop.yarn.client.api.impl.TestAMRMClient
            org.apache.hadoop.yarn.client.api.impl.TestNMClient
          JDK v1.7.0_95 Failed junit tests hadoop.yarn.server.TestContainerManagerSecurity
            hadoop.yarn.server.TestMiniYarnClusterNodeUtilization
            hadoop.yarn.client.api.impl.TestAMRMProxy
            hadoop.yarn.client.TestGetGroups
          JDK v1.7.0_95 Timed out junit tests org.apache.hadoop.yarn.client.cli.TestYarnCLI
            org.apache.hadoop.yarn.client.api.impl.TestYarnClient
            org.apache.hadoop.yarn.client.api.impl.TestAMRMClient
            org.apache.hadoop.yarn.client.api.impl.TestNMClient



          Subsystem Report/Notes
          Docker Image:yetus/hadoop:0ca8df7
          JIRA Patch URL https://issues.apache.org/jira/secure/attachment/12792610/YARN-4117.v3.patch
          JIRA Issue YARN-4117
          Optional Tests asflicense compile javac javadoc mvninstall mvnsite unit findbugs checkstyle
          uname Linux 4b7a5578ac2b 3.13.0-36-lowlatency #63-Ubuntu SMP PREEMPT Wed Sep 3 21:56:12 UTC 2014 x86_64 x86_64 x86_64 GNU/Linux
          Build tool maven
          Personality /testptch/hadoop/patchprocess/precommit/personality/provided.sh
          git revision trunk / e01c6ea
          Default Java 1.7.0_95
          Multi-JDK versions /usr/lib/jvm/java-8-oracle:1.8.0_74 /usr/lib/jvm/java-7-openjdk-amd64:1.7.0_95
          findbugs v3.0.0
          checkstyle https://builds.apache.org/job/PreCommit-YARN-Build/10758/artifact/patchprocess/diff-checkstyle-hadoop-yarn-project_hadoop-yarn.txt
          unit https://builds.apache.org/job/PreCommit-YARN-Build/10758/artifact/patchprocess/patch-unit-hadoop-yarn-project_hadoop-yarn_hadoop-yarn-server_hadoop-yarn-server-tests-jdk1.8.0_74.txt
          unit https://builds.apache.org/job/PreCommit-YARN-Build/10758/artifact/patchprocess/patch-unit-hadoop-yarn-project_hadoop-yarn_hadoop-yarn-client-jdk1.8.0_74.txt
          unit https://builds.apache.org/job/PreCommit-YARN-Build/10758/artifact/patchprocess/patch-unit-hadoop-yarn-project_hadoop-yarn_hadoop-yarn-server_hadoop-yarn-server-tests-jdk1.7.0_95.txt
          unit https://builds.apache.org/job/PreCommit-YARN-Build/10758/artifact/patchprocess/patch-unit-hadoop-yarn-project_hadoop-yarn_hadoop-yarn-client-jdk1.7.0_95.txt
          unit test logs https://builds.apache.org/job/PreCommit-YARN-Build/10758/artifact/patchprocess/patch-unit-hadoop-yarn-project_hadoop-yarn_hadoop-yarn-server_hadoop-yarn-server-tests-jdk1.8.0_74.txt https://builds.apache.org/job/PreCommit-YARN-Build/10758/artifact/patchprocess/patch-unit-hadoop-yarn-project_hadoop-yarn_hadoop-yarn-client-jdk1.8.0_74.txt https://builds.apache.org/job/PreCommit-YARN-Build/10758/artifact/patchprocess/patch-unit-hadoop-yarn-project_hadoop-yarn_hadoop-yarn-server_hadoop-yarn-server-tests-jdk1.7.0_95.txt https://builds.apache.org/job/PreCommit-YARN-Build/10758/artifact/patchprocess/patch-unit-hadoop-yarn-project_hadoop-yarn_hadoop-yarn-client-jdk1.7.0_95.txt
          JDK v1.7.0_95 Test Results https://builds.apache.org/job/PreCommit-YARN-Build/10758/testReport/
          modules C: hadoop-yarn-project/hadoop-yarn/hadoop-yarn-server/hadoop-yarn-server-nodemanager hadoop-yarn-project/hadoop-yarn/hadoop-yarn-server/hadoop-yarn-server-tests hadoop-yarn-project/hadoop-yarn/hadoop-yarn-client U: hadoop-yarn-project/hadoop-yarn
          Console output https://builds.apache.org/job/PreCommit-YARN-Build/10758/console
          Powered by Apache Yetus 0.2.0 http://yetus.apache.org

          This message was automatically generated.

          Show
          hadoopqa Hadoop QA added a comment - -1 overall Vote Subsystem Runtime Comment 0 reexec 0m 15s Docker mode activated. +1 @author 0m 0s The patch does not contain any @author tags. +1 test4tests 0m 0s The patch appears to include 2 new or modified test files. 0 mvndep 0m 24s Maven dependency ordering for branch +1 mvninstall 6m 47s trunk passed +1 compile 1m 46s trunk passed with JDK v1.8.0_74 +1 compile 2m 6s trunk passed with JDK v1.7.0_95 +1 checkstyle 0m 33s trunk passed +1 mvnsite 1m 13s trunk passed +1 mvneclipse 0m 41s trunk passed +1 findbugs 1m 50s trunk passed +1 javadoc 0m 45s trunk passed with JDK v1.8.0_74 +1 javadoc 0m 54s trunk passed with JDK v1.7.0_95 0 mvndep 0m 10s Maven dependency ordering for patch +1 mvninstall 1m 0s the patch passed +1 compile 1m 42s the patch passed with JDK v1.8.0_74 +1 javac 1m 42s the patch passed +1 compile 2m 3s the patch passed with JDK v1.7.0_95 +1 javac 2m 3s the patch passed -1 checkstyle 0m 31s hadoop-yarn-project/hadoop-yarn: patch generated 3 new + 54 unchanged - 0 fixed = 57 total (was 54) +1 mvnsite 1m 6s the patch passed +1 mvneclipse 0m 34s the patch passed +1 whitespace 0m 0s Patch has no whitespace issues. +1 findbugs 2m 19s the patch passed +1 javadoc 0m 41s the patch passed with JDK v1.8.0_74 +1 javadoc 0m 50s the patch passed with JDK v1.7.0_95 +1 unit 9m 9s hadoop-yarn-server-nodemanager in the patch passed with JDK v1.8.0_74. -1 unit 7m 7s hadoop-yarn-server-tests in the patch failed with JDK v1.8.0_74. -1 unit 66m 6s hadoop-yarn-client in the patch failed with JDK v1.8.0_74. +1 unit 10m 14s hadoop-yarn-server-nodemanager in the patch passed with JDK v1.7.0_95. -1 unit 7m 23s hadoop-yarn-server-tests in the patch failed with JDK v1.7.0_95. -1 unit 66m 22s hadoop-yarn-client in the patch failed with JDK v1.7.0_95. +1 asflicense 0m 20s Patch does not generate ASF License warnings. 196m 11s Reason Tests JDK v1.8.0_74 Failed junit tests hadoop.yarn.server.TestContainerManagerSecurity   hadoop.yarn.server.TestMiniYarnClusterNodeUtilization   hadoop.yarn.client.api.impl.TestAMRMProxy   hadoop.yarn.client.TestGetGroups JDK v1.8.0_74 Timed out junit tests org.apache.hadoop.yarn.client.cli.TestYarnCLI   org.apache.hadoop.yarn.client.api.impl.TestYarnClient   org.apache.hadoop.yarn.client.api.impl.TestAMRMClient   org.apache.hadoop.yarn.client.api.impl.TestNMClient JDK v1.7.0_95 Failed junit tests hadoop.yarn.server.TestContainerManagerSecurity   hadoop.yarn.server.TestMiniYarnClusterNodeUtilization   hadoop.yarn.client.api.impl.TestAMRMProxy   hadoop.yarn.client.TestGetGroups JDK v1.7.0_95 Timed out junit tests org.apache.hadoop.yarn.client.cli.TestYarnCLI   org.apache.hadoop.yarn.client.api.impl.TestYarnClient   org.apache.hadoop.yarn.client.api.impl.TestAMRMClient   org.apache.hadoop.yarn.client.api.impl.TestNMClient Subsystem Report/Notes Docker Image:yetus/hadoop:0ca8df7 JIRA Patch URL https://issues.apache.org/jira/secure/attachment/12792610/YARN-4117.v3.patch JIRA Issue YARN-4117 Optional Tests asflicense compile javac javadoc mvninstall mvnsite unit findbugs checkstyle uname Linux 4b7a5578ac2b 3.13.0-36-lowlatency #63-Ubuntu SMP PREEMPT Wed Sep 3 21:56:12 UTC 2014 x86_64 x86_64 x86_64 GNU/Linux Build tool maven Personality /testptch/hadoop/patchprocess/precommit/personality/provided.sh git revision trunk / e01c6ea Default Java 1.7.0_95 Multi-JDK versions /usr/lib/jvm/java-8-oracle:1.8.0_74 /usr/lib/jvm/java-7-openjdk-amd64:1.7.0_95 findbugs v3.0.0 checkstyle https://builds.apache.org/job/PreCommit-YARN-Build/10758/artifact/patchprocess/diff-checkstyle-hadoop-yarn-project_hadoop-yarn.txt unit https://builds.apache.org/job/PreCommit-YARN-Build/10758/artifact/patchprocess/patch-unit-hadoop-yarn-project_hadoop-yarn_hadoop-yarn-server_hadoop-yarn-server-tests-jdk1.8.0_74.txt unit https://builds.apache.org/job/PreCommit-YARN-Build/10758/artifact/patchprocess/patch-unit-hadoop-yarn-project_hadoop-yarn_hadoop-yarn-client-jdk1.8.0_74.txt unit https://builds.apache.org/job/PreCommit-YARN-Build/10758/artifact/patchprocess/patch-unit-hadoop-yarn-project_hadoop-yarn_hadoop-yarn-server_hadoop-yarn-server-tests-jdk1.7.0_95.txt unit https://builds.apache.org/job/PreCommit-YARN-Build/10758/artifact/patchprocess/patch-unit-hadoop-yarn-project_hadoop-yarn_hadoop-yarn-client-jdk1.7.0_95.txt unit test logs https://builds.apache.org/job/PreCommit-YARN-Build/10758/artifact/patchprocess/patch-unit-hadoop-yarn-project_hadoop-yarn_hadoop-yarn-server_hadoop-yarn-server-tests-jdk1.8.0_74.txt https://builds.apache.org/job/PreCommit-YARN-Build/10758/artifact/patchprocess/patch-unit-hadoop-yarn-project_hadoop-yarn_hadoop-yarn-client-jdk1.8.0_74.txt https://builds.apache.org/job/PreCommit-YARN-Build/10758/artifact/patchprocess/patch-unit-hadoop-yarn-project_hadoop-yarn_hadoop-yarn-server_hadoop-yarn-server-tests-jdk1.7.0_95.txt https://builds.apache.org/job/PreCommit-YARN-Build/10758/artifact/patchprocess/patch-unit-hadoop-yarn-project_hadoop-yarn_hadoop-yarn-client-jdk1.7.0_95.txt JDK v1.7.0_95 Test Results https://builds.apache.org/job/PreCommit-YARN-Build/10758/testReport/ modules C: hadoop-yarn-project/hadoop-yarn/hadoop-yarn-server/hadoop-yarn-server-nodemanager hadoop-yarn-project/hadoop-yarn/hadoop-yarn-server/hadoop-yarn-server-tests hadoop-yarn-project/hadoop-yarn/hadoop-yarn-client U: hadoop-yarn-project/hadoop-yarn Console output https://builds.apache.org/job/PreCommit-YARN-Build/10758/console Powered by Apache Yetus 0.2.0 http://yetus.apache.org This message was automatically generated.
          Hide
          jianhe Jian He added a comment -

          looks good to me, just some minor nits:

          • I think these two methods are not needed, as it can just use the amrmProxyEnabled flag directly
            @Private

            public boolean isAMRMProxyEnabled() {
  	
            return amrmProxyEnabled;

            }


            @Private

            public void setAMRMProxyEnabled(boolean amrmProxyEnabled) 
            {
  this.amrmProxyEnabled = amrmProxyEnabled;
}
            
          • change the visibility to protected.
            @Private
public void setAMRMProxyService(AMRMProxyService amrmProxyService) {
  this.amrmProxyService = amrmProxyService;
}
            
          Show
          jianhe Jian He added a comment - looks good to me, just some minor nits: I think these two methods are not needed, as it can just use the amrmProxyEnabled flag directly @Private
 public boolean isAMRMProxyEnabled() {
 return amrmProxyEnabled;
 }

 @Private
 public void setAMRMProxyEnabled( boolean amrmProxyEnabled) {
 this .amrmProxyEnabled = amrmProxyEnabled;
} change the visibility to protected. @Private
 public void setAMRMProxyService(AMRMProxyService amrmProxyService) {
 this .amrmProxyService = amrmProxyService;
}
          Hide
          giovanni.fumarola Giovanni Matteo Fumarola added a comment -

          I just ran all the tests that failed or timed out and they completed fine in my machine.
          My only concern is about the checkstyle.

          Show
          giovanni.fumarola Giovanni Matteo Fumarola added a comment - I just ran all the tests that failed or timed out and they completed fine in my machine. My only concern is about the checkstyle.
          Hide
          hadoopqa Hadoop QA added a comment -
          -1 overall



          Vote Subsystem Runtime Comment
          0 reexec 0m 19s Docker mode activated.
          +1 @author 0m 0s The patch does not contain any @author tags.
          +1 test4tests 0m 0s The patch appears to include 2 new or modified test files.
          0 mvndep 0m 23s Maven dependency ordering for branch
          +1 mvninstall 7m 59s trunk passed
          +1 compile 2m 47s trunk passed with JDK v1.8.0_74
          +1 compile 2m 52s trunk passed with JDK v1.7.0_95
          +1 checkstyle 0m 41s trunk passed
          +1 mvnsite 1m 21s trunk passed
          +1 mvneclipse 0m 48s trunk passed
          +1 findbugs 2m 11s trunk passed
          +1 javadoc 1m 5s trunk passed with JDK v1.8.0_74
          +1 javadoc 1m 9s trunk passed with JDK v1.7.0_95
          0 mvndep 0m 11s Maven dependency ordering for patch
          +1 mvninstall 1m 15s the patch passed
          +1 compile 2m 46s the patch passed with JDK v1.8.0_74
          +1 javac 2m 46s the patch passed
          +1 compile 2m 27s the patch passed with JDK v1.7.0_95
          +1 javac 2m 27s the patch passed
          -1 checkstyle 0m 34s hadoop-yarn-project/hadoop-yarn: patch generated 3 new + 55 unchanged - 0 fixed = 58 total (was 55)
          +1 mvnsite 1m 12s the patch passed
          +1 mvneclipse 0m 37s the patch passed
          +1 whitespace 0m 0s Patch has no whitespace issues.
          +1 findbugs 2m 37s the patch passed
          +1 javadoc 0m 56s the patch passed with JDK v1.8.0_74
          +1 javadoc 0m 58s the patch passed with JDK v1.7.0_95
          +1 unit 10m 12s hadoop-yarn-server-nodemanager in the patch passed with JDK v1.8.0_74.
          -1 unit 7m 14s hadoop-yarn-server-tests in the patch failed with JDK v1.8.0_74.
          -1 unit 66m 27s hadoop-yarn-client in the patch failed with JDK v1.8.0_74.
          +1 unit 10m 2s hadoop-yarn-server-nodemanager in the patch passed with JDK v1.7.0_95.
          -1 unit 7m 12s hadoop-yarn-server-tests in the patch failed with JDK v1.7.0_95.
          -1 unit 66m 23s hadoop-yarn-client in the patch failed with JDK v1.7.0_95.
          +1 asflicense 0m 21s Patch does not generate ASF License warnings.
          204m 28s



          Reason Tests
          JDK v1.8.0_74 Failed junit tests hadoop.yarn.server.TestContainerManagerSecurity
            hadoop.yarn.server.TestMiniYarnClusterNodeUtilization
            hadoop.yarn.client.TestGetGroups
            hadoop.yarn.client.api.impl.TestAMRMProxy
          JDK v1.8.0_74 Timed out junit tests org.apache.hadoop.yarn.client.cli.TestYarnCLI
            org.apache.hadoop.yarn.client.api.impl.TestYarnClient
            org.apache.hadoop.yarn.client.api.impl.TestAMRMClient
            org.apache.hadoop.yarn.client.api.impl.TestNMClient
          JDK v1.7.0_95 Failed junit tests hadoop.yarn.server.TestContainerManagerSecurity
            hadoop.yarn.server.TestMiniYarnClusterNodeUtilization
            hadoop.yarn.client.TestGetGroups
            hadoop.yarn.client.api.impl.TestAMRMProxy
          JDK v1.7.0_95 Timed out junit tests org.apache.hadoop.yarn.client.cli.TestYarnCLI
            org.apache.hadoop.yarn.client.api.impl.TestYarnClient
            org.apache.hadoop.yarn.client.api.impl.TestAMRMClient
            org.apache.hadoop.yarn.client.api.impl.TestNMClient



          Subsystem Report/Notes
          Docker Image:yetus/hadoop:0ca8df7
          JIRA Patch URL https://issues.apache.org/jira/secure/attachment/12791884/YARN-4117.v2.patch
          JIRA Issue YARN-4117
          Optional Tests asflicense compile javac javadoc mvninstall mvnsite unit findbugs checkstyle
          uname Linux f593131c2852 3.13.0-36-lowlatency #63-Ubuntu SMP PREEMPT Wed Sep 3 21:56:12 UTC 2014 x86_64 x86_64 x86_64 GNU/Linux
          Build tool maven
          Personality /testptch/hadoop/patchprocess/precommit/personality/provided.sh
          git revision trunk / 391da36
          Default Java 1.7.0_95
          Multi-JDK versions /usr/lib/jvm/java-8-oracle:1.8.0_74 /usr/lib/jvm/java-7-openjdk-amd64:1.7.0_95
          findbugs v3.0.0
          checkstyle https://builds.apache.org/job/PreCommit-YARN-Build/10719/artifact/patchprocess/diff-checkstyle-hadoop-yarn-project_hadoop-yarn.txt
          unit https://builds.apache.org/job/PreCommit-YARN-Build/10719/artifact/patchprocess/patch-unit-hadoop-yarn-project_hadoop-yarn_hadoop-yarn-server_hadoop-yarn-server-tests-jdk1.8.0_74.txt
          unit https://builds.apache.org/job/PreCommit-YARN-Build/10719/artifact/patchprocess/patch-unit-hadoop-yarn-project_hadoop-yarn_hadoop-yarn-client-jdk1.8.0_74.txt
          unit https://builds.apache.org/job/PreCommit-YARN-Build/10719/artifact/patchprocess/patch-unit-hadoop-yarn-project_hadoop-yarn_hadoop-yarn-server_hadoop-yarn-server-tests-jdk1.7.0_95.txt
          unit https://builds.apache.org/job/PreCommit-YARN-Build/10719/artifact/patchprocess/patch-unit-hadoop-yarn-project_hadoop-yarn_hadoop-yarn-client-jdk1.7.0_95.txt
          unit test logs https://builds.apache.org/job/PreCommit-YARN-Build/10719/artifact/patchprocess/patch-unit-hadoop-yarn-project_hadoop-yarn_hadoop-yarn-server_hadoop-yarn-server-tests-jdk1.8.0_74.txt https://builds.apache.org/job/PreCommit-YARN-Build/10719/artifact/patchprocess/patch-unit-hadoop-yarn-project_hadoop-yarn_hadoop-yarn-client-jdk1.8.0_74.txt https://builds.apache.org/job/PreCommit-YARN-Build/10719/artifact/patchprocess/patch-unit-hadoop-yarn-project_hadoop-yarn_hadoop-yarn-server_hadoop-yarn-server-tests-jdk1.7.0_95.txt https://builds.apache.org/job/PreCommit-YARN-Build/10719/artifact/patchprocess/patch-unit-hadoop-yarn-project_hadoop-yarn_hadoop-yarn-client-jdk1.7.0_95.txt
          JDK v1.7.0_95 Test Results https://builds.apache.org/job/PreCommit-YARN-Build/10719/testReport/
          modules C: hadoop-yarn-project/hadoop-yarn/hadoop-yarn-server/hadoop-yarn-server-nodemanager hadoop-yarn-project/hadoop-yarn/hadoop-yarn-server/hadoop-yarn-server-tests hadoop-yarn-project/hadoop-yarn/hadoop-yarn-client U: hadoop-yarn-project/hadoop-yarn
          Console output https://builds.apache.org/job/PreCommit-YARN-Build/10719/console
          Powered by Apache Yetus 0.2.0 http://yetus.apache.org

          This message was automatically generated.

          Show
          hadoopqa Hadoop QA added a comment - -1 overall Vote Subsystem Runtime Comment 0 reexec 0m 19s Docker mode activated. +1 @author 0m 0s The patch does not contain any @author tags. +1 test4tests 0m 0s The patch appears to include 2 new or modified test files. 0 mvndep 0m 23s Maven dependency ordering for branch +1 mvninstall 7m 59s trunk passed +1 compile 2m 47s trunk passed with JDK v1.8.0_74 +1 compile 2m 52s trunk passed with JDK v1.7.0_95 +1 checkstyle 0m 41s trunk passed +1 mvnsite 1m 21s trunk passed +1 mvneclipse 0m 48s trunk passed +1 findbugs 2m 11s trunk passed +1 javadoc 1m 5s trunk passed with JDK v1.8.0_74 +1 javadoc 1m 9s trunk passed with JDK v1.7.0_95 0 mvndep 0m 11s Maven dependency ordering for patch +1 mvninstall 1m 15s the patch passed +1 compile 2m 46s the patch passed with JDK v1.8.0_74 +1 javac 2m 46s the patch passed +1 compile 2m 27s the patch passed with JDK v1.7.0_95 +1 javac 2m 27s the patch passed -1 checkstyle 0m 34s hadoop-yarn-project/hadoop-yarn: patch generated 3 new + 55 unchanged - 0 fixed = 58 total (was 55) +1 mvnsite 1m 12s the patch passed +1 mvneclipse 0m 37s the patch passed +1 whitespace 0m 0s Patch has no whitespace issues. +1 findbugs 2m 37s the patch passed +1 javadoc 0m 56s the patch passed with JDK v1.8.0_74 +1 javadoc 0m 58s the patch passed with JDK v1.7.0_95 +1 unit 10m 12s hadoop-yarn-server-nodemanager in the patch passed with JDK v1.8.0_74. -1 unit 7m 14s hadoop-yarn-server-tests in the patch failed with JDK v1.8.0_74. -1 unit 66m 27s hadoop-yarn-client in the patch failed with JDK v1.8.0_74. +1 unit 10m 2s hadoop-yarn-server-nodemanager in the patch passed with JDK v1.7.0_95. -1 unit 7m 12s hadoop-yarn-server-tests in the patch failed with JDK v1.7.0_95. -1 unit 66m 23s hadoop-yarn-client in the patch failed with JDK v1.7.0_95. +1 asflicense 0m 21s Patch does not generate ASF License warnings. 204m 28s Reason Tests JDK v1.8.0_74 Failed junit tests hadoop.yarn.server.TestContainerManagerSecurity   hadoop.yarn.server.TestMiniYarnClusterNodeUtilization   hadoop.yarn.client.TestGetGroups   hadoop.yarn.client.api.impl.TestAMRMProxy JDK v1.8.0_74 Timed out junit tests org.apache.hadoop.yarn.client.cli.TestYarnCLI   org.apache.hadoop.yarn.client.api.impl.TestYarnClient   org.apache.hadoop.yarn.client.api.impl.TestAMRMClient   org.apache.hadoop.yarn.client.api.impl.TestNMClient JDK v1.7.0_95 Failed junit tests hadoop.yarn.server.TestContainerManagerSecurity   hadoop.yarn.server.TestMiniYarnClusterNodeUtilization   hadoop.yarn.client.TestGetGroups   hadoop.yarn.client.api.impl.TestAMRMProxy JDK v1.7.0_95 Timed out junit tests org.apache.hadoop.yarn.client.cli.TestYarnCLI   org.apache.hadoop.yarn.client.api.impl.TestYarnClient   org.apache.hadoop.yarn.client.api.impl.TestAMRMClient   org.apache.hadoop.yarn.client.api.impl.TestNMClient Subsystem Report/Notes Docker Image:yetus/hadoop:0ca8df7 JIRA Patch URL https://issues.apache.org/jira/secure/attachment/12791884/YARN-4117.v2.patch JIRA Issue YARN-4117 Optional Tests asflicense compile javac javadoc mvninstall mvnsite unit findbugs checkstyle uname Linux f593131c2852 3.13.0-36-lowlatency #63-Ubuntu SMP PREEMPT Wed Sep 3 21:56:12 UTC 2014 x86_64 x86_64 x86_64 GNU/Linux Build tool maven Personality /testptch/hadoop/patchprocess/precommit/personality/provided.sh git revision trunk / 391da36 Default Java 1.7.0_95 Multi-JDK versions /usr/lib/jvm/java-8-oracle:1.8.0_74 /usr/lib/jvm/java-7-openjdk-amd64:1.7.0_95 findbugs v3.0.0 checkstyle https://builds.apache.org/job/PreCommit-YARN-Build/10719/artifact/patchprocess/diff-checkstyle-hadoop-yarn-project_hadoop-yarn.txt unit https://builds.apache.org/job/PreCommit-YARN-Build/10719/artifact/patchprocess/patch-unit-hadoop-yarn-project_hadoop-yarn_hadoop-yarn-server_hadoop-yarn-server-tests-jdk1.8.0_74.txt unit https://builds.apache.org/job/PreCommit-YARN-Build/10719/artifact/patchprocess/patch-unit-hadoop-yarn-project_hadoop-yarn_hadoop-yarn-client-jdk1.8.0_74.txt unit https://builds.apache.org/job/PreCommit-YARN-Build/10719/artifact/patchprocess/patch-unit-hadoop-yarn-project_hadoop-yarn_hadoop-yarn-server_hadoop-yarn-server-tests-jdk1.7.0_95.txt unit https://builds.apache.org/job/PreCommit-YARN-Build/10719/artifact/patchprocess/patch-unit-hadoop-yarn-project_hadoop-yarn_hadoop-yarn-client-jdk1.7.0_95.txt unit test logs https://builds.apache.org/job/PreCommit-YARN-Build/10719/artifact/patchprocess/patch-unit-hadoop-yarn-project_hadoop-yarn_hadoop-yarn-server_hadoop-yarn-server-tests-jdk1.8.0_74.txt https://builds.apache.org/job/PreCommit-YARN-Build/10719/artifact/patchprocess/patch-unit-hadoop-yarn-project_hadoop-yarn_hadoop-yarn-client-jdk1.8.0_74.txt https://builds.apache.org/job/PreCommit-YARN-Build/10719/artifact/patchprocess/patch-unit-hadoop-yarn-project_hadoop-yarn_hadoop-yarn-server_hadoop-yarn-server-tests-jdk1.7.0_95.txt https://builds.apache.org/job/PreCommit-YARN-Build/10719/artifact/patchprocess/patch-unit-hadoop-yarn-project_hadoop-yarn_hadoop-yarn-client-jdk1.7.0_95.txt JDK v1.7.0_95 Test Results https://builds.apache.org/job/PreCommit-YARN-Build/10719/testReport/ modules C: hadoop-yarn-project/hadoop-yarn/hadoop-yarn-server/hadoop-yarn-server-nodemanager hadoop-yarn-project/hadoop-yarn/hadoop-yarn-server/hadoop-yarn-server-tests hadoop-yarn-project/hadoop-yarn/hadoop-yarn-client U: hadoop-yarn-project/hadoop-yarn Console output https://builds.apache.org/job/PreCommit-YARN-Build/10719/console Powered by Apache Yetus 0.2.0 http://yetus.apache.org This message was automatically generated.
          Hide
          jianhe Jian He added a comment -

          MiniYarnCluster allocates the ports for the RM during the Start phase, and there was no way to pass the information to the AMRMProxy.

          I think this approach may not work for HA case where you will have multiple RM scheduler address. could you check how NM talks to RM ? I think NM have the same problem. we may let AMRMProxy follow the same method ?

          Show
          jianhe Jian He added a comment - MiniYarnCluster allocates the ports for the RM during the Start phase, and there was no way to pass the information to the AMRMProxy. I think this approach may not work for HA case where you will have multiple RM scheduler address. could you check how NM talks to RM ? I think NM have the same problem. we may let AMRMProxy follow the same method ?
          Hide
          hadoopqa Hadoop QA added a comment -
          -1 overall



          Vote Subsystem Runtime Comment
          0 reexec 0m 19s Docker mode activated.
          +1 @author 0m 0s The patch does not contain any @author tags.
          +1 test4tests 0m 0s The patch appears to include 2 new or modified test files.
          0 mvndep 0m 11s Maven dependency ordering for branch
          +1 mvninstall 6m 35s trunk passed
          +1 compile 1m 45s trunk passed with JDK v1.8.0_72
          +1 compile 2m 8s trunk passed with JDK v1.7.0_95
          +1 checkstyle 0m 32s trunk passed
          +1 mvnsite 1m 14s trunk passed
          +1 mvneclipse 0m 40s trunk passed
          +1 findbugs 1m 50s trunk passed
          +1 javadoc 0m 47s trunk passed with JDK v1.8.0_72
          +1 javadoc 0m 54s trunk passed with JDK v1.7.0_95
          0 mvndep 0m 10s Maven dependency ordering for patch
          -1 mvninstall 0m 13s hadoop-yarn-server-tests in the patch failed.
          -1 compile 1m 28s hadoop-yarn in the patch failed with JDK v1.8.0_72.
          -1 javac 1m 28s hadoop-yarn in the patch failed with JDK v1.8.0_72.
          -1 compile 1m 35s hadoop-yarn in the patch failed with JDK v1.7.0_95.
          -1 javac 1m 35s hadoop-yarn in the patch failed with JDK v1.7.0_95.
          +1 checkstyle 0m 31s the patch passed
          -1 mvnsite 0m 15s hadoop-yarn-server-tests in the patch failed.
          +1 mvneclipse 0m 34s the patch passed
          +1 whitespace 0m 0s Patch has no whitespace issues.
          -1 findbugs 0m 12s hadoop-yarn-server-tests in the patch failed.
          +1 javadoc 0m 41s the patch passed with JDK v1.8.0_72
          +1 javadoc 0m 51s the patch passed with JDK v1.7.0_95
          +1 unit 9m 12s hadoop-yarn-server-nodemanager in the patch passed with JDK v1.8.0_72.
          -1 unit 0m 13s hadoop-yarn-server-tests in the patch failed with JDK v1.8.0_72.
          -1 unit 66m 4s hadoop-yarn-client in the patch failed with JDK v1.8.0_72.
          +1 unit 9m 39s hadoop-yarn-server-nodemanager in the patch passed with JDK v1.7.0_95.
          -1 unit 0m 14s hadoop-yarn-server-tests in the patch failed with JDK v1.7.0_95.
          -1 unit 66m 17s hadoop-yarn-client in the patch failed with JDK v1.7.0_95.
          +1 asflicense 0m 18s Patch does not generate ASF License warnings.
          179m 48s



          Reason Tests
          JDK v1.8.0_72 Failed junit tests hadoop.yarn.client.api.impl.TestAMRMProxy
            hadoop.yarn.client.TestGetGroups
          JDK v1.8.0_72 Timed out junit tests org.apache.hadoop.yarn.client.cli.TestYarnCLI
            org.apache.hadoop.yarn.client.api.impl.TestYarnClient
            org.apache.hadoop.yarn.client.api.impl.TestAMRMClient
            org.apache.hadoop.yarn.client.api.impl.TestNMClient
          JDK v1.7.0_95 Failed junit tests hadoop.yarn.client.api.impl.TestAMRMProxy
            hadoop.yarn.client.TestGetGroups
          JDK v1.7.0_95 Timed out junit tests org.apache.hadoop.yarn.client.cli.TestYarnCLI
            org.apache.hadoop.yarn.client.api.impl.TestYarnClient
            org.apache.hadoop.yarn.client.api.impl.TestAMRMClient
            org.apache.hadoop.yarn.client.api.impl.TestNMClient



          Subsystem Report/Notes
          Docker Image:yetus/hadoop:0ca8df7
          JIRA Patch URL https://issues.apache.org/jira/secure/attachment/12790210/YARN-4117.v1.patch
          JIRA Issue YARN-4117
          Optional Tests asflicense compile javac javadoc mvninstall mvnsite unit findbugs checkstyle
          uname Linux 3f9874ada8c6 3.13.0-36-lowlatency #63-Ubuntu SMP PREEMPT Wed Sep 3 21:56:12 UTC 2014 x86_64 x86_64 x86_64 GNU/Linux
          Build tool maven
          Personality /testptch/hadoop/patchprocess/precommit/personality/provided.sh
          git revision trunk / 6b0f813
          Default Java 1.7.0_95
          Multi-JDK versions /usr/lib/jvm/java-8-oracle:1.8.0_72 /usr/lib/jvm/java-7-openjdk-amd64:1.7.0_95
          findbugs v3.0.0
          mvninstall https://builds.apache.org/job/PreCommit-YARN-Build/10653/artifact/patchprocess/patch-mvninstall-hadoop-yarn-project_hadoop-yarn_hadoop-yarn-server_hadoop-yarn-server-tests.txt
          compile https://builds.apache.org/job/PreCommit-YARN-Build/10653/artifact/patchprocess/patch-compile-hadoop-yarn-project_hadoop-yarn-jdk1.8.0_72.txt
          javac https://builds.apache.org/job/PreCommit-YARN-Build/10653/artifact/patchprocess/patch-compile-hadoop-yarn-project_hadoop-yarn-jdk1.8.0_72.txt
          compile https://builds.apache.org/job/PreCommit-YARN-Build/10653/artifact/patchprocess/patch-compile-hadoop-yarn-project_hadoop-yarn-jdk1.7.0_95.txt
          javac https://builds.apache.org/job/PreCommit-YARN-Build/10653/artifact/patchprocess/patch-compile-hadoop-yarn-project_hadoop-yarn-jdk1.7.0_95.txt
          mvnsite https://builds.apache.org/job/PreCommit-YARN-Build/10653/artifact/patchprocess/patch-mvnsite-hadoop-yarn-project_hadoop-yarn_hadoop-yarn-server_hadoop-yarn-server-tests.txt
          findbugs https://builds.apache.org/job/PreCommit-YARN-Build/10653/artifact/patchprocess/patch-findbugs-hadoop-yarn-project_hadoop-yarn_hadoop-yarn-server_hadoop-yarn-server-tests.txt
          unit https://builds.apache.org/job/PreCommit-YARN-Build/10653/artifact/patchprocess/patch-unit-hadoop-yarn-project_hadoop-yarn_hadoop-yarn-server_hadoop-yarn-server-tests-jdk1.8.0_72.txt
          unit https://builds.apache.org/job/PreCommit-YARN-Build/10653/artifact/patchprocess/patch-unit-hadoop-yarn-project_hadoop-yarn_hadoop-yarn-client-jdk1.8.0_72.txt
          unit https://builds.apache.org/job/PreCommit-YARN-Build/10653/artifact/patchprocess/patch-unit-hadoop-yarn-project_hadoop-yarn_hadoop-yarn-server_hadoop-yarn-server-tests-jdk1.7.0_95.txt
          unit https://builds.apache.org/job/PreCommit-YARN-Build/10653/artifact/patchprocess/patch-unit-hadoop-yarn-project_hadoop-yarn_hadoop-yarn-client-jdk1.7.0_95.txt
          unit test logs https://builds.apache.org/job/PreCommit-YARN-Build/10653/artifact/patchprocess/patch-unit-hadoop-yarn-project_hadoop-yarn_hadoop-yarn-client-jdk1.8.0_72.txt https://builds.apache.org/job/PreCommit-YARN-Build/10653/artifact/patchprocess/patch-unit-hadoop-yarn-project_hadoop-yarn_hadoop-yarn-client-jdk1.7.0_95.txt
          JDK v1.7.0_95 Test Results https://builds.apache.org/job/PreCommit-YARN-Build/10653/testReport/
          modules C: hadoop-yarn-project/hadoop-yarn/hadoop-yarn-server/hadoop-yarn-server-nodemanager hadoop-yarn-project/hadoop-yarn/hadoop-yarn-server/hadoop-yarn-server-tests hadoop-yarn-project/hadoop-yarn/hadoop-yarn-client U: hadoop-yarn-project/hadoop-yarn
          Console output https://builds.apache.org/job/PreCommit-YARN-Build/10653/console
          Powered by Apache Yetus 0.2.0-SNAPSHOT http://yetus.apache.org

          This message was automatically generated.

          Show
          hadoopqa Hadoop QA added a comment - -1 overall Vote Subsystem Runtime Comment 0 reexec 0m 19s Docker mode activated. +1 @author 0m 0s The patch does not contain any @author tags. +1 test4tests 0m 0s The patch appears to include 2 new or modified test files. 0 mvndep 0m 11s Maven dependency ordering for branch +1 mvninstall 6m 35s trunk passed +1 compile 1m 45s trunk passed with JDK v1.8.0_72 +1 compile 2m 8s trunk passed with JDK v1.7.0_95 +1 checkstyle 0m 32s trunk passed +1 mvnsite 1m 14s trunk passed +1 mvneclipse 0m 40s trunk passed +1 findbugs 1m 50s trunk passed +1 javadoc 0m 47s trunk passed with JDK v1.8.0_72 +1 javadoc 0m 54s trunk passed with JDK v1.7.0_95 0 mvndep 0m 10s Maven dependency ordering for patch -1 mvninstall 0m 13s hadoop-yarn-server-tests in the patch failed. -1 compile 1m 28s hadoop-yarn in the patch failed with JDK v1.8.0_72. -1 javac 1m 28s hadoop-yarn in the patch failed with JDK v1.8.0_72. -1 compile 1m 35s hadoop-yarn in the patch failed with JDK v1.7.0_95. -1 javac 1m 35s hadoop-yarn in the patch failed with JDK v1.7.0_95. +1 checkstyle 0m 31s the patch passed -1 mvnsite 0m 15s hadoop-yarn-server-tests in the patch failed. +1 mvneclipse 0m 34s the patch passed +1 whitespace 0m 0s Patch has no whitespace issues. -1 findbugs 0m 12s hadoop-yarn-server-tests in the patch failed. +1 javadoc 0m 41s the patch passed with JDK v1.8.0_72 +1 javadoc 0m 51s the patch passed with JDK v1.7.0_95 +1 unit 9m 12s hadoop-yarn-server-nodemanager in the patch passed with JDK v1.8.0_72. -1 unit 0m 13s hadoop-yarn-server-tests in the patch failed with JDK v1.8.0_72. -1 unit 66m 4s hadoop-yarn-client in the patch failed with JDK v1.8.0_72. +1 unit 9m 39s hadoop-yarn-server-nodemanager in the patch passed with JDK v1.7.0_95. -1 unit 0m 14s hadoop-yarn-server-tests in the patch failed with JDK v1.7.0_95. -1 unit 66m 17s hadoop-yarn-client in the patch failed with JDK v1.7.0_95. +1 asflicense 0m 18s Patch does not generate ASF License warnings. 179m 48s Reason Tests JDK v1.8.0_72 Failed junit tests hadoop.yarn.client.api.impl.TestAMRMProxy   hadoop.yarn.client.TestGetGroups JDK v1.8.0_72 Timed out junit tests org.apache.hadoop.yarn.client.cli.TestYarnCLI   org.apache.hadoop.yarn.client.api.impl.TestYarnClient   org.apache.hadoop.yarn.client.api.impl.TestAMRMClient   org.apache.hadoop.yarn.client.api.impl.TestNMClient JDK v1.7.0_95 Failed junit tests hadoop.yarn.client.api.impl.TestAMRMProxy   hadoop.yarn.client.TestGetGroups JDK v1.7.0_95 Timed out junit tests org.apache.hadoop.yarn.client.cli.TestYarnCLI   org.apache.hadoop.yarn.client.api.impl.TestYarnClient   org.apache.hadoop.yarn.client.api.impl.TestAMRMClient   org.apache.hadoop.yarn.client.api.impl.TestNMClient Subsystem Report/Notes Docker Image:yetus/hadoop:0ca8df7 JIRA Patch URL https://issues.apache.org/jira/secure/attachment/12790210/YARN-4117.v1.patch JIRA Issue YARN-4117 Optional Tests asflicense compile javac javadoc mvninstall mvnsite unit findbugs checkstyle uname Linux 3f9874ada8c6 3.13.0-36-lowlatency #63-Ubuntu SMP PREEMPT Wed Sep 3 21:56:12 UTC 2014 x86_64 x86_64 x86_64 GNU/Linux Build tool maven Personality /testptch/hadoop/patchprocess/precommit/personality/provided.sh git revision trunk / 6b0f813 Default Java 1.7.0_95 Multi-JDK versions /usr/lib/jvm/java-8-oracle:1.8.0_72 /usr/lib/jvm/java-7-openjdk-amd64:1.7.0_95 findbugs v3.0.0 mvninstall https://builds.apache.org/job/PreCommit-YARN-Build/10653/artifact/patchprocess/patch-mvninstall-hadoop-yarn-project_hadoop-yarn_hadoop-yarn-server_hadoop-yarn-server-tests.txt compile https://builds.apache.org/job/PreCommit-YARN-Build/10653/artifact/patchprocess/patch-compile-hadoop-yarn-project_hadoop-yarn-jdk1.8.0_72.txt javac https://builds.apache.org/job/PreCommit-YARN-Build/10653/artifact/patchprocess/patch-compile-hadoop-yarn-project_hadoop-yarn-jdk1.8.0_72.txt compile https://builds.apache.org/job/PreCommit-YARN-Build/10653/artifact/patchprocess/patch-compile-hadoop-yarn-project_hadoop-yarn-jdk1.7.0_95.txt javac https://builds.apache.org/job/PreCommit-YARN-Build/10653/artifact/patchprocess/patch-compile-hadoop-yarn-project_hadoop-yarn-jdk1.7.0_95.txt mvnsite https://builds.apache.org/job/PreCommit-YARN-Build/10653/artifact/patchprocess/patch-mvnsite-hadoop-yarn-project_hadoop-yarn_hadoop-yarn-server_hadoop-yarn-server-tests.txt findbugs https://builds.apache.org/job/PreCommit-YARN-Build/10653/artifact/patchprocess/patch-findbugs-hadoop-yarn-project_hadoop-yarn_hadoop-yarn-server_hadoop-yarn-server-tests.txt unit https://builds.apache.org/job/PreCommit-YARN-Build/10653/artifact/patchprocess/patch-unit-hadoop-yarn-project_hadoop-yarn_hadoop-yarn-server_hadoop-yarn-server-tests-jdk1.8.0_72.txt unit https://builds.apache.org/job/PreCommit-YARN-Build/10653/artifact/patchprocess/patch-unit-hadoop-yarn-project_hadoop-yarn_hadoop-yarn-client-jdk1.8.0_72.txt unit https://builds.apache.org/job/PreCommit-YARN-Build/10653/artifact/patchprocess/patch-unit-hadoop-yarn-project_hadoop-yarn_hadoop-yarn-server_hadoop-yarn-server-tests-jdk1.7.0_95.txt unit https://builds.apache.org/job/PreCommit-YARN-Build/10653/artifact/patchprocess/patch-unit-hadoop-yarn-project_hadoop-yarn_hadoop-yarn-client-jdk1.7.0_95.txt unit test logs https://builds.apache.org/job/PreCommit-YARN-Build/10653/artifact/patchprocess/patch-unit-hadoop-yarn-project_hadoop-yarn_hadoop-yarn-client-jdk1.8.0_72.txt https://builds.apache.org/job/PreCommit-YARN-Build/10653/artifact/patchprocess/patch-unit-hadoop-yarn-project_hadoop-yarn_hadoop-yarn-client-jdk1.7.0_95.txt JDK v1.7.0_95 Test Results https://builds.apache.org/job/PreCommit-YARN-Build/10653/testReport/ modules C: hadoop-yarn-project/hadoop-yarn/hadoop-yarn-server/hadoop-yarn-server-nodemanager hadoop-yarn-project/hadoop-yarn/hadoop-yarn-server/hadoop-yarn-server-tests hadoop-yarn-project/hadoop-yarn/hadoop-yarn-client U: hadoop-yarn-project/hadoop-yarn Console output https://builds.apache.org/job/PreCommit-YARN-Build/10653/console Powered by Apache Yetus 0.2.0-SNAPSHOT http://yetus.apache.org This message was automatically generated.
          Hide
          giovanni.fumarola Giovanni Matteo Fumarola added a comment -

          Jian He, thanks for reviewing the patch.
          1. Sure;
          2. Sure, I will check it.
          3. Because I can customize CustomContainerManagerImpl and AMRMProxyService.
          MiniYarnCluster allocates the ports for the RM during the Start phase, and there was no way to pass the information to the AMRMProxy.
          For this reason I save the value of the Scheduler address and in the Customizazion I inform the AMRMProxy what is the address it will connect to.
          4. The purpose of testE2ETokenSwap is to verified that the AMRMProxy swapped the security token and the AM cannot submit the job directly to the RM.

          I will update the patch according to the feedback.

          Show
          giovanni.fumarola Giovanni Matteo Fumarola added a comment - Jian He , thanks for reviewing the patch. 1. Sure; 2. Sure, I will check it. 3. Because I can customize CustomContainerManagerImpl and AMRMProxyService. MiniYarnCluster allocates the ports for the RM during the Start phase, and there was no way to pass the information to the AMRMProxy. For this reason I save the value of the Scheduler address and in the Customizazion I inform the AMRMProxy what is the address it will connect to. 4. The purpose of testE2ETokenSwap is to verified that the AMRMProxy swapped the security token and the AM cannot submit the job directly to the RM. I will update the patch according to the feedback.
          Hide
          jianhe Jian He added a comment -

          Giovanni Matteo Fumarola, thanks for working on this, a few comments and questions :
          1. could you add comments at the header of each test to explain what the test is doing so that it can be understood more easily?
          2. this test is based on timing, can we check that AllocateResponse#getAMRMToken actually returns a different token than previous one ?

                for (int i = 0; i < 5; i++) {
                  client.allocate(request);
                  request.setResponseId(request.getResponseId() + 1);
          
                  // Time slot to be sure the RM renew the token
                  Thread.sleep(1500);
                }
          

          3. why are the changes in MiniYarnCluster needed ?
          4. what is the purpose of testE2ETokenSwap?

          Show
          jianhe Jian He added a comment - Giovanni Matteo Fumarola , thanks for working on this, a few comments and questions : 1. could you add comments at the header of each test to explain what the test is doing so that it can be understood more easily? 2. this test is based on timing, can we check that AllocateResponse#getAMRMToken actually returns a different token than previous one ? for ( int i = 0; i < 5; i++) { client.allocate(request); request.setResponseId(request.getResponseId() + 1); // Time slot to be sure the RM renew the token Thread .sleep(1500); } 3. why are the changes in MiniYarnCluster needed ? 4. what is the purpose of testE2ETokenSwap?
          Hide
          giovanni.fumarola Giovanni Matteo Fumarola added a comment -

          I just ran all the tests that failed or timed out and they completed fine in my machine.

          My only concern is about the checkstyle.

          Show
          giovanni.fumarola Giovanni Matteo Fumarola added a comment - I just ran all the tests that failed or timed out and they completed fine in my machine. My only concern is about the checkstyle.
          Hide
          hadoopqa Hadoop QA added a comment -
          -1 overall



          Vote Subsystem Runtime Comment
          0 reexec 0m 13s Docker mode activated.
          +1 @author 0m 0s The patch does not contain any @author tags.
          +1 test4tests 0m 0s The patch appears to include 2 new or modified test files.
          0 mvndep 0m 10s Maven dependency ordering for branch
          +1 mvninstall 6m 42s trunk passed
          +1 compile 1m 54s trunk passed with JDK v1.8.0_72
          +1 compile 2m 7s trunk passed with JDK v1.7.0_95
          +1 checkstyle 0m 33s trunk passed
          +1 mvnsite 1m 13s trunk passed
          +1 mvneclipse 0m 40s trunk passed
          +1 findbugs 1m 58s trunk passed
          +1 javadoc 0m 51s trunk passed with JDK v1.8.0_72
          +1 javadoc 0m 58s trunk passed with JDK v1.7.0_95
          0 mvndep 0m 12s Maven dependency ordering for patch
          +1 mvninstall 1m 0s the patch passed
          +1 compile 1m 55s the patch passed with JDK v1.8.0_72
          +1 javac 1m 55s the patch passed
          +1 compile 2m 6s the patch passed with JDK v1.7.0_95
          +1 javac 2m 6s the patch passed
          -1 checkstyle 0m 31s hadoop-yarn-project/hadoop-yarn: patch generated 3 new + 55 unchanged - 0 fixed = 58 total (was 55)
          +1 mvnsite 1m 9s the patch passed
          +1 mvneclipse 0m 35s the patch passed
          -1 whitespace 0m 0s The patch has 1 line(s) that end in whitespace. Use git apply --whitespace=fix.
          +1 findbugs 2m 22s the patch passed
          +1 javadoc 0m 43s the patch passed with JDK v1.8.0_72
          +1 javadoc 0m 51s the patch passed with JDK v1.7.0_95
          +1 unit 8m 48s hadoop-yarn-server-nodemanager in the patch passed with JDK v1.8.0_72.
          -1 unit 6m 45s hadoop-yarn-server-tests in the patch failed with JDK v1.8.0_72.
          -1 unit 66m 5s hadoop-yarn-client in the patch failed with JDK v1.8.0_72.
          +1 unit 9m 15s hadoop-yarn-server-nodemanager in the patch passed with JDK v1.7.0_95.
          -1 unit 7m 6s hadoop-yarn-server-tests in the patch failed with JDK v1.7.0_95.
          -1 unit 66m 15s hadoop-yarn-client in the patch failed with JDK v1.7.0_95.
          +1 asflicense 0m 19s Patch does not generate ASF License warnings.
          194m 34s



          Reason Tests
          JDK v1.8.0_72 Failed junit tests hadoop.yarn.server.TestContainerManagerSecurity
            hadoop.yarn.server.TestMiniYarnClusterNodeUtilization
            hadoop.yarn.client.api.impl.TestAMRMProxy
            hadoop.yarn.client.TestGetGroups
          JDK v1.8.0_72 Timed out junit tests org.apache.hadoop.yarn.client.cli.TestYarnCLI
            org.apache.hadoop.yarn.client.api.impl.TestYarnClient
            org.apache.hadoop.yarn.client.api.impl.TestAMRMClient
            org.apache.hadoop.yarn.client.api.impl.TestNMClient
          JDK v1.7.0_95 Failed junit tests hadoop.yarn.server.TestContainerManagerSecurity
            hadoop.yarn.server.TestMiniYarnClusterNodeUtilization
            hadoop.yarn.client.api.impl.TestAMRMProxy
            hadoop.yarn.client.TestGetGroups
          JDK v1.7.0_95 Timed out junit tests org.apache.hadoop.yarn.client.cli.TestYarnCLI
            org.apache.hadoop.yarn.client.api.impl.TestYarnClient
            org.apache.hadoop.yarn.client.api.impl.TestAMRMClient
            org.apache.hadoop.yarn.client.api.impl.TestNMClient



          Subsystem Report/Notes
          Docker Image:yetus/hadoop:0ca8df7
          JIRA Patch URL https://issues.apache.org/jira/secure/attachment/12788080/YARN-4117.v0.patch
          JIRA Issue YARN-4117
          Optional Tests asflicense compile javac javadoc mvninstall mvnsite unit findbugs checkstyle
          uname Linux 9aaa2a663fb8 3.13.0-36-lowlatency #63-Ubuntu SMP PREEMPT Wed Sep 3 21:56:12 UTC 2014 x86_64 x86_64 x86_64 GNU/Linux
          Build tool maven
          Personality /testptch/hadoop/patchprocess/precommit/personality/provided.sh
          git revision trunk / 4b0e59f
          Default Java 1.7.0_95
          Multi-JDK versions /usr/lib/jvm/java-8-oracle:1.8.0_72 /usr/lib/jvm/java-7-openjdk-amd64:1.7.0_95
          findbugs v3.0.0
          checkstyle https://builds.apache.org/job/PreCommit-YARN-Build/10573/artifact/patchprocess/diff-checkstyle-hadoop-yarn-project_hadoop-yarn.txt
          whitespace https://builds.apache.org/job/PreCommit-YARN-Build/10573/artifact/patchprocess/whitespace-eol.txt
          unit https://builds.apache.org/job/PreCommit-YARN-Build/10573/artifact/patchprocess/patch-unit-hadoop-yarn-project_hadoop-yarn_hadoop-yarn-server_hadoop-yarn-server-tests-jdk1.8.0_72.txt
          unit https://builds.apache.org/job/PreCommit-YARN-Build/10573/artifact/patchprocess/patch-unit-hadoop-yarn-project_hadoop-yarn_hadoop-yarn-client-jdk1.8.0_72.txt
          unit https://builds.apache.org/job/PreCommit-YARN-Build/10573/artifact/patchprocess/patch-unit-hadoop-yarn-project_hadoop-yarn_hadoop-yarn-server_hadoop-yarn-server-tests-jdk1.7.0_95.txt
          unit https://builds.apache.org/job/PreCommit-YARN-Build/10573/artifact/patchprocess/patch-unit-hadoop-yarn-project_hadoop-yarn_hadoop-yarn-client-jdk1.7.0_95.txt
          unit test logs https://builds.apache.org/job/PreCommit-YARN-Build/10573/artifact/patchprocess/patch-unit-hadoop-yarn-project_hadoop-yarn_hadoop-yarn-server_hadoop-yarn-server-tests-jdk1.8.0_72.txt https://builds.apache.org/job/PreCommit-YARN-Build/10573/artifact/patchprocess/patch-unit-hadoop-yarn-project_hadoop-yarn_hadoop-yarn-client-jdk1.8.0_72.txt https://builds.apache.org/job/PreCommit-YARN-Build/10573/artifact/patchprocess/patch-unit-hadoop-yarn-project_hadoop-yarn_hadoop-yarn-server_hadoop-yarn-server-tests-jdk1.7.0_95.txt https://builds.apache.org/job/PreCommit-YARN-Build/10573/artifact/patchprocess/patch-unit-hadoop-yarn-project_hadoop-yarn_hadoop-yarn-client-jdk1.7.0_95.txt
          JDK v1.7.0_95 Test Results https://builds.apache.org/job/PreCommit-YARN-Build/10573/testReport/
          modules C: hadoop-yarn-project/hadoop-yarn/hadoop-yarn-server/hadoop-yarn-server-nodemanager hadoop-yarn-project/hadoop-yarn/hadoop-yarn-server/hadoop-yarn-server-tests hadoop-yarn-project/hadoop-yarn/hadoop-yarn-client U: hadoop-yarn-project/hadoop-yarn
          Console output https://builds.apache.org/job/PreCommit-YARN-Build/10573/console
          Powered by Apache Yetus 0.2.0-SNAPSHOT http://yetus.apache.org

          This message was automatically generated.

          Show
          hadoopqa Hadoop QA added a comment - -1 overall Vote Subsystem Runtime Comment 0 reexec 0m 13s Docker mode activated. +1 @author 0m 0s The patch does not contain any @author tags. +1 test4tests 0m 0s The patch appears to include 2 new or modified test files. 0 mvndep 0m 10s Maven dependency ordering for branch +1 mvninstall 6m 42s trunk passed +1 compile 1m 54s trunk passed with JDK v1.8.0_72 +1 compile 2m 7s trunk passed with JDK v1.7.0_95 +1 checkstyle 0m 33s trunk passed +1 mvnsite 1m 13s trunk passed +1 mvneclipse 0m 40s trunk passed +1 findbugs 1m 58s trunk passed +1 javadoc 0m 51s trunk passed with JDK v1.8.0_72 +1 javadoc 0m 58s trunk passed with JDK v1.7.0_95 0 mvndep 0m 12s Maven dependency ordering for patch +1 mvninstall 1m 0s the patch passed +1 compile 1m 55s the patch passed with JDK v1.8.0_72 +1 javac 1m 55s the patch passed +1 compile 2m 6s the patch passed with JDK v1.7.0_95 +1 javac 2m 6s the patch passed -1 checkstyle 0m 31s hadoop-yarn-project/hadoop-yarn: patch generated 3 new + 55 unchanged - 0 fixed = 58 total (was 55) +1 mvnsite 1m 9s the patch passed +1 mvneclipse 0m 35s the patch passed -1 whitespace 0m 0s The patch has 1 line(s) that end in whitespace. Use git apply --whitespace=fix. +1 findbugs 2m 22s the patch passed +1 javadoc 0m 43s the patch passed with JDK v1.8.0_72 +1 javadoc 0m 51s the patch passed with JDK v1.7.0_95 +1 unit 8m 48s hadoop-yarn-server-nodemanager in the patch passed with JDK v1.8.0_72. -1 unit 6m 45s hadoop-yarn-server-tests in the patch failed with JDK v1.8.0_72. -1 unit 66m 5s hadoop-yarn-client in the patch failed with JDK v1.8.0_72. +1 unit 9m 15s hadoop-yarn-server-nodemanager in the patch passed with JDK v1.7.0_95. -1 unit 7m 6s hadoop-yarn-server-tests in the patch failed with JDK v1.7.0_95. -1 unit 66m 15s hadoop-yarn-client in the patch failed with JDK v1.7.0_95. +1 asflicense 0m 19s Patch does not generate ASF License warnings. 194m 34s Reason Tests JDK v1.8.0_72 Failed junit tests hadoop.yarn.server.TestContainerManagerSecurity   hadoop.yarn.server.TestMiniYarnClusterNodeUtilization   hadoop.yarn.client.api.impl.TestAMRMProxy   hadoop.yarn.client.TestGetGroups JDK v1.8.0_72 Timed out junit tests org.apache.hadoop.yarn.client.cli.TestYarnCLI   org.apache.hadoop.yarn.client.api.impl.TestYarnClient   org.apache.hadoop.yarn.client.api.impl.TestAMRMClient   org.apache.hadoop.yarn.client.api.impl.TestNMClient JDK v1.7.0_95 Failed junit tests hadoop.yarn.server.TestContainerManagerSecurity   hadoop.yarn.server.TestMiniYarnClusterNodeUtilization   hadoop.yarn.client.api.impl.TestAMRMProxy   hadoop.yarn.client.TestGetGroups JDK v1.7.0_95 Timed out junit tests org.apache.hadoop.yarn.client.cli.TestYarnCLI   org.apache.hadoop.yarn.client.api.impl.TestYarnClient   org.apache.hadoop.yarn.client.api.impl.TestAMRMClient   org.apache.hadoop.yarn.client.api.impl.TestNMClient Subsystem Report/Notes Docker Image:yetus/hadoop:0ca8df7 JIRA Patch URL https://issues.apache.org/jira/secure/attachment/12788080/YARN-4117.v0.patch JIRA Issue YARN-4117 Optional Tests asflicense compile javac javadoc mvninstall mvnsite unit findbugs checkstyle uname Linux 9aaa2a663fb8 3.13.0-36-lowlatency #63-Ubuntu SMP PREEMPT Wed Sep 3 21:56:12 UTC 2014 x86_64 x86_64 x86_64 GNU/Linux Build tool maven Personality /testptch/hadoop/patchprocess/precommit/personality/provided.sh git revision trunk / 4b0e59f Default Java 1.7.0_95 Multi-JDK versions /usr/lib/jvm/java-8-oracle:1.8.0_72 /usr/lib/jvm/java-7-openjdk-amd64:1.7.0_95 findbugs v3.0.0 checkstyle https://builds.apache.org/job/PreCommit-YARN-Build/10573/artifact/patchprocess/diff-checkstyle-hadoop-yarn-project_hadoop-yarn.txt whitespace https://builds.apache.org/job/PreCommit-YARN-Build/10573/artifact/patchprocess/whitespace-eol.txt unit https://builds.apache.org/job/PreCommit-YARN-Build/10573/artifact/patchprocess/patch-unit-hadoop-yarn-project_hadoop-yarn_hadoop-yarn-server_hadoop-yarn-server-tests-jdk1.8.0_72.txt unit https://builds.apache.org/job/PreCommit-YARN-Build/10573/artifact/patchprocess/patch-unit-hadoop-yarn-project_hadoop-yarn_hadoop-yarn-client-jdk1.8.0_72.txt unit https://builds.apache.org/job/PreCommit-YARN-Build/10573/artifact/patchprocess/patch-unit-hadoop-yarn-project_hadoop-yarn_hadoop-yarn-server_hadoop-yarn-server-tests-jdk1.7.0_95.txt unit https://builds.apache.org/job/PreCommit-YARN-Build/10573/artifact/patchprocess/patch-unit-hadoop-yarn-project_hadoop-yarn_hadoop-yarn-client-jdk1.7.0_95.txt unit test logs https://builds.apache.org/job/PreCommit-YARN-Build/10573/artifact/patchprocess/patch-unit-hadoop-yarn-project_hadoop-yarn_hadoop-yarn-server_hadoop-yarn-server-tests-jdk1.8.0_72.txt https://builds.apache.org/job/PreCommit-YARN-Build/10573/artifact/patchprocess/patch-unit-hadoop-yarn-project_hadoop-yarn_hadoop-yarn-client-jdk1.8.0_72.txt https://builds.apache.org/job/PreCommit-YARN-Build/10573/artifact/patchprocess/patch-unit-hadoop-yarn-project_hadoop-yarn_hadoop-yarn-server_hadoop-yarn-server-tests-jdk1.7.0_95.txt https://builds.apache.org/job/PreCommit-YARN-Build/10573/artifact/patchprocess/patch-unit-hadoop-yarn-project_hadoop-yarn_hadoop-yarn-client-jdk1.7.0_95.txt JDK v1.7.0_95 Test Results https://builds.apache.org/job/PreCommit-YARN-Build/10573/testReport/ modules C: hadoop-yarn-project/hadoop-yarn/hadoop-yarn-server/hadoop-yarn-server-nodemanager hadoop-yarn-project/hadoop-yarn/hadoop-yarn-server/hadoop-yarn-server-tests hadoop-yarn-project/hadoop-yarn/hadoop-yarn-client U: hadoop-yarn-project/hadoop-yarn Console output https://builds.apache.org/job/PreCommit-YARN-Build/10573/console Powered by Apache Yetus 0.2.0-SNAPSHOT http://yetus.apache.org This message was automatically generated.
          Hide
          giovanni.fumarola Giovanni Matteo Fumarola added a comment -

          Hi Jian He
          Can you please review this patch?
          I am asking you because you reviewed and pushed the AMRMProxy on YARN-2884.

          Show
          giovanni.fumarola Giovanni Matteo Fumarola added a comment - Hi Jian He Can you please review this patch? I am asking you because you reviewed and pushed the AMRMProxy on YARN-2884 .

            People

            • Assignee:
              giovanni.fumarola Giovanni Matteo Fumarola
              Reporter:
              kishorch Kishore Chaliparambil
            • Votes:
              0 Vote for this issue
              Watchers:
              8 Start watching this issue

              Dates

              • Created:
                Updated:
                Resolved:

                Development