Uploaded image for project: 'Hadoop YARN'
  1. Hadoop YARN
  2. YARN-3910

TestRMAppTransitions#testAppAcceptedAttemptKilled fails on trunk

    XMLWordPrintableJSON

    Details

    • Type: Bug
    • Status: Resolved
    • Priority: Major
    • Resolution: Duplicate
    • Affects Version/s: 2.7.0
    • Fix Version/s: None
    • Component/s: None
    • Labels:
      None
    • Target Version/s:

      Description

      Check https://builds.apache.org/job/PreCommit-YARN-Build/8493/testReport/

      Running org.apache.hadoop.yarn.server.resourcemanager.rmapp.TestRMAppTransitions
      Tests run: 44, Failures: 2, Errors: 0, Skipped: 0, Time elapsed: 3.515 sec <<< FAILURE! - in org.apache.hadoop.yarn.server.resourcemanager.rmapp.TestRMAppTransitions
      testAppAcceptedAttemptKilled[0](org.apache.hadoop.yarn.server.resourcemanager.rmapp.TestRMAppTransitions)  Time elapsed: 0.049 sec  <<< FAILURE!
      java.lang.AssertionError: expected:<APP_REMOVED> but was:<APP_ATTEMPT_ADDED>
      	at org.junit.Assert.fail(Assert.java:88)
      	at org.junit.Assert.failNotEquals(Assert.java:743)
      	at org.junit.Assert.assertEquals(Assert.java:118)
      	at org.junit.Assert.assertEquals(Assert.java:144)
      	at org.apache.hadoop.yarn.server.resourcemanager.rmapp.TestRMAppTransitions.verifyAppRemovedSchedulerEvent(TestRMAppTransitions.java:1032)
      	at org.apache.hadoop.yarn.server.resourcemanager.rmapp.TestRMAppTransitions.testAppAcceptedAttemptKilled(TestRMAppTransitions.java:742)
      
      testAppAcceptedAttemptKilled[1](org.apache.hadoop.yarn.server.resourcemanager.rmapp.TestRMAppTransitions)  Time elapsed: 0.031 sec  <<< FAILURE!
      java.lang.AssertionError: expected:<APP_REMOVED> but was:<APP_ATTEMPT_ADDED>
      	at org.junit.Assert.fail(Assert.java:88)
      	at org.junit.Assert.failNotEquals(Assert.java:743)
      	at org.junit.Assert.assertEquals(Assert.java:118)
      	at org.junit.Assert.assertEquals(Assert.java:144)
      	at org.apache.hadoop.yarn.server.resourcemanager.rmapp.TestRMAppTransitions.verifyAppRemovedSchedulerEvent(TestRMAppTransitions.java:1032)
      	at org.apache.hadoop.yarn.server.resourcemanager.rmapp.TestRMAppTransitions.testAppAcceptedAttemptKilled(TestRMAppTransitions.java:742)
      

        Attachments

        1. YARN-3910.02.patch
          2 kB
          Varun Saxena
        2. YARN-3910.001.patch
          2 kB
          Varun Saxena

          Issue Links

            Activity

              People

              • Assignee:
                varun_saxena Varun Saxena
                Reporter:
                varun_saxena Varun Saxena
              • Votes:
                0 Vote for this issue
                Watchers:
                3 Start watching this issue

                Dates

                • Created:
                  Updated:
                  Resolved: