Uploaded image for project: 'Hadoop YARN'
  1. Hadoop YARN
  2. YARN-30

TestNMWebServicesApps, TestRMWebServicesApps and TestRMWebServicesNodes fail on jdk7

VotersWatch issueWatchersCreate sub-taskLinkCloneUpdate Comment AuthorReplace String in CommentUpdate Comment VisibilityDelete Comments
    XMLWordPrintableJSON

Details

    • Bug
    • Status: Closed
    • Major
    • Resolution: Fixed
    • 2.0.2-alpha, 0.23.3
    • 2.0.3-alpha, 0.23.5
    • None

    Description

      It looks like the string changed from "const class" to "constant".

      Tests run: 19, Failures: 3, Errors: 0, Skipped: 0, Time elapsed: 6.786 sec <<< FAILURE!
      testNodeAppsStateInvalid(org.apache.hadoop.yarn.server.nodemanager.webapp.TestNMWebServicesApps) Time elapsed: 0.248 sec <<< FAILURE!
      java.lang.AssertionError: exception message doesn't match, got: No enum constant org.apache.hadoop.yarn.server.nodemanager.containermanager.application.ApplicationState.FOO_STATE expected: No enum const class org.apache.hadoop.yarn.server.nodemanager.containermanager.application.ApplicationState.FOO_STATE

      Attachments

        1. YARN-30.1.patch
          7 kB
          Vinod Kumar Vavilapalli
        2. YARN-30.patch
          6 kB
          Thomas Graves
        3. YARN-30.patch
          7 kB
          Thomas Graves
        4. YARN-30.patch
          6 kB
          Thomas Graves
        5. YARN-30-branch23.patch
          6 kB
          Thomas Graves

        Issue Links

        Activity

          This comment will be Viewable by All Users Viewable by All Users
          Cancel

          People

            tgraves Thomas Graves
            tgraves Thomas Graves
            Votes:
            0 Vote for this issue
            Watchers:
            5 Start watching this issue

            Dates

              Created:
              Updated:
              Resolved:

              Slack

                Issue deployment