Uploaded image for project: 'Hadoop YARN'
  1. Hadoop YARN
  2. YARN-10363

TestRMAdminCLI.testHelp is failing in branch-2.10

    XMLWordPrintableJSON

    Details

    • Type: Bug
    • Status: Resolved
    • Priority: Major
    • Resolution: Fixed
    • Affects Version/s: 2.10.1
    • Fix Version/s: 3.1.4, 2.10.1
    • Component/s: yarn
    • Labels:
      None

      Description

      TestRMAdminCLI.testHelp is failing in branch-2.10.

      Example failure:

      -------------------------------------------------------------------------------
      Test set: org.apache.hadoop.yarn.client.cli.TestRMAdminCLI
      -------------------------------------------------------------------------------
      Tests run: 31, Failures: 2, Errors: 0, Skipped: 0, Time elapsed: 18.668 s <<< FAILURE! - in org.apache.hadoop.yarn.client.cli.TestRMAdminCLI
      testHelp(org.apache.hadoop.yarn.client.cli.TestRMAdminCLI)  Time elapsed: 0.043 s  <<< FAILURE!
      java.lang.AssertionError: 
      Expected error message: 
      Usage: yarn rmadmin [-failover [--forcefence] [--forceactive] <serviceId> <serviceId>] is not included in messages: 
      Usage: yarn rmadmin
         -refreshQueues 
         -refreshNodes [-g|graceful [timeout in seconds] -client|server]
         -refreshNodesResources 
         -refreshSuperUserGroupsConfiguration 
         -refreshUserToGroupsMappings 
         -refreshAdminAcls 
         -refreshServiceAcl 
         -getGroups [username]
         -addToClusterNodeLabels <"label1(exclusive=true),label2(exclusive=false),label3">
         -removeFromClusterNodeLabels <label1,label2,label3> (label splitted by ",")
         -replaceLabelsOnNode <"node1[:port]=label1,label2 node2[:port]=label1,label2"> [-failOnUnknownNodes] 
         -directlyAccessNodeLabelStore 
         -refreshClusterMaxPriority 
         -updateNodeResource [NodeID] [MemSize] [vCores] ([OvercommitTimeout])
         -help [cmd]
      
      Generic options supported are:
      -conf <configuration file>        specify an application configuration file
      -D <property=value>               define a value for a given property
      -fs <file:///|hdfs://namenode:port> specify default filesystem URL to use, overrides 'fs.defaultFS' property from configurations.
      -jt <local|resourcemanager:port>  specify a ResourceManager
      -files <file1,...>                specify a comma-separated list of files to be copied to the map reduce cluster
      -libjars <jar1,...>               specify a comma-separated list of jar files to be included in the classpath
      -archives <archive1,...>          specify a comma-separated list of archives to be unarchived on the compute machines
      
      The general command line syntax is:
      command [genericOptions] [commandOptions]
      
      
      	at org.junit.Assert.fail(Assert.java:88)
      	at org.junit.Assert.assertTrue(Assert.java:41)
      	at org.apache.hadoop.yarn.client.cli.TestRMAdminCLI.testError(TestRMAdminCLI.java:859)
      	at org.apache.hadoop.yarn.client.cli.TestRMAdminCLI.testHelp(TestRMAdminCLI.java:585)
      	at sun.reflect.NativeMethodAccessorImpl.invoke0(Native Method)
      	at sun.reflect.NativeMethodAccessorImpl.invoke(NativeMethodAccessorImpl.java:62)
      	at sun.reflect.DelegatingMethodAccessorImpl.invoke(DelegatingMethodAccessorImpl.java:43)
      	at java.lang.reflect.Method.invoke(Method.java:498)
      	at org.junit.runners.model.FrameworkMethod$1.runReflectiveCall(FrameworkMethod.java:47)
      	at org.junit.internal.runners.model.ReflectiveCallable.run(ReflectiveCallable.java:12)
      	at org.junit.runners.model.FrameworkMethod.invokeExplosively(FrameworkMethod.java:44)
      	at org.junit.internal.runners.statements.InvokeMethod.evaluate(InvokeMethod.java:17)
      	at org.junit.internal.runners.statements.RunBefores.evaluate(RunBefores.java:26)
      	at org.junit.runners.ParentRunner.runLeaf(ParentRunner.java:271)
      	at org.junit.runners.BlockJUnit4ClassRunner.runChild(BlockJUnit4ClassRunner.java:70)
      	at org.junit.runners.BlockJUnit4ClassRunner.runChild(BlockJUnit4ClassRunner.java:50)
      	at org.junit.runners.ParentRunner$3.run(ParentRunner.java:238)
      	at org.junit.runners.ParentRunner$1.schedule(ParentRunner.java:63)
      	at org.junit.runners.ParentRunner.runChildren(ParentRunner.java:236)
      	at org.junit.runners.ParentRunner.access$000(ParentRunner.java:53)
      	at org.junit.runners.ParentRunner$2.evaluate(ParentRunner.java:229)
      	at org.junit.runners.ParentRunner.run(ParentRunner.java:309)
      	at org.apache.maven.surefire.junit4.JUnit4Provider.execute(JUnit4Provider.java:365)
      	at org.apache.maven.surefire.junit4.JUnit4Provider.executeWithRerun(JUnit4Provider.java:273)
      	at org.apache.maven.surefire.junit4.JUnit4Provider.executeTestSet(JUnit4Provider.java:238)
      	at org.apache.maven.surefire.junit4.JUnit4Provider.invoke(JUnit4Provider.java:159)
      	at org.apache.maven.surefire.booter.ForkedBooter.invokeProviderInSameClassLoader(ForkedBooter.java:384)
      	at org.apache.maven.surefire.booter.ForkedBooter.runSuitesInProcess(ForkedBooter.java:345)
      	at org.apache.maven.surefire.booter.ForkedBooter.execute(ForkedBooter.java:126)
      	at org.apache.maven.surefire.booter.ForkedBooter.main(ForkedBooter.java:418)
      
      testRMHAErrorUsage(org.apache.hadoop.yarn.client.cli.TestRMAdminCLI)  Time elapsed: 0.023 s  <<< FAILURE!
      java.lang.AssertionError
      	at org.junit.Assert.fail(Assert.java:86)
      	at org.junit.Assert.assertTrue(Assert.java:41)
      	at org.junit.Assert.assertTrue(Assert.java:52)
      	at org.apache.hadoop.yarn.client.cli.TestRMAdminCLI.testRMHAErrorUsage(TestRMAdminCLI.java:874)
      	at sun.reflect.NativeMethodAccessorImpl.invoke0(Native Method)
      	at sun.reflect.NativeMethodAccessorImpl.invoke(NativeMethodAccessorImpl.java:62)
      	at sun.reflect.DelegatingMethodAccessorImpl.invoke(DelegatingMethodAccessorImpl.java:43)
      	at java.lang.reflect.Method.invoke(Method.java:498)
      	at org.junit.runners.model.FrameworkMethod$1.runReflectiveCall(FrameworkMethod.java:47)
      	at org.junit.internal.runners.model.ReflectiveCallable.run(ReflectiveCallable.java:12)
      	at org.junit.runners.model.FrameworkMethod.invokeExplosively(FrameworkMethod.java:44)
      	at org.junit.internal.runners.statements.InvokeMethod.evaluate(InvokeMethod.java:17)
      	at org.junit.internal.runners.statements.RunBefores.evaluate(RunBefores.java:26)
      	at org.junit.runners.ParentRunner.runLeaf(ParentRunner.java:271)
      	at org.junit.runners.BlockJUnit4ClassRunner.runChild(BlockJUnit4ClassRunner.java:70)
      	at org.junit.runners.BlockJUnit4ClassRunner.runChild(BlockJUnit4ClassRunner.java:50)
      	at org.junit.runners.ParentRunner$3.run(ParentRunner.java:238)
      	at org.junit.runners.ParentRunner$1.schedule(ParentRunner.java:63)
      	at org.junit.runners.ParentRunner.runChildren(ParentRunner.java:236)
      	at org.junit.runners.ParentRunner.access$000(ParentRunner.java:53)
      	at org.junit.runners.ParentRunner$2.evaluate(ParentRunner.java:229)
      	at org.junit.runners.ParentRunner.run(ParentRunner.java:309)
      	at org.apache.maven.surefire.junit4.JUnit4Provider.execute(JUnit4Provider.java:365)
      	at org.apache.maven.surefire.junit4.JUnit4Provider.executeWithRerun(JUnit4Provider.java:273)
      	at org.apache.maven.surefire.junit4.JUnit4Provider.executeTestSet(JUnit4Provider.java:238)
      	at org.apache.maven.surefire.junit4.JUnit4Provider.invoke(JUnit4Provider.java:159)
      	at org.apache.maven.surefire.booter.ForkedBooter.invokeProviderInSameClassLoader(ForkedBooter.java:384)
      	at org.apache.maven.surefire.booter.ForkedBooter.runSuitesInProcess(ForkedBooter.java:345)
      	at org.apache.maven.surefire.booter.ForkedBooter.execute(ForkedBooter.java:126)
      	at org.apache.maven.surefire.booter.ForkedBooter.main(ForkedBooter.java:418)
       

      I believe this started failing after HADOOP-16753 was committed.

        Attachments

          Issue Links

            Activity

              People

              • Assignee:
                BilwaST Bilwa S T
                Reporter:
                Jim_Brennan Jim Brennan
              • Votes:
                0 Vote for this issue
                Watchers:
                5 Start watching this issue

                Dates

                • Created:
                  Updated:
                  Resolved: