Tuscany
  1. Tuscany
  2. TUSCANY-3983

Many itest failures when running with JDK7

    Details

    • Type: Bug Bug
    • Status: Open
    • Priority: Major Major
    • Resolution: Unresolved
    • Affects Version/s: None
    • Fix Version/s: Java-SCA-2.0
    • Component/s: None
    • Labels:
      None

      Description

      Many itest failures when running with JDK7:

      [ERROR] Failed to execute goal org.apache.maven.plugins:maven-surefire-plugin:2.4.3:test (default-test) on project itest-async-servic
      es: There are test failures.
      [ERROR]
      [ERROR] Please refer to C:\Tuscany\SVN\trunk4\testing\itest\async-services\target\surefire-reports for the individual test results.
      [ERROR] -> [Help 1]
      [ERROR] Failed to execute goal org.apache.maven.plugins:maven-surefire-plugin:2.4.3:test (default-test) on project itest-base-depende
      ncies: There are test failures.
      [ERROR]
      [ERROR] Please refer to C:\Tuscany\SVN\trunk4\testing\itest\base\dependencies\target\surefire-reports for the individual test results
      .
      [ERROR] -> [Help 1]
      [ERROR] Failed to execute goal org.apache.maven.plugins:maven-surefire-plugin:2.4.3:test (default-test) on project itest-builder: The
      re are test failures.
      [ERROR]
      [ERROR] Please refer to C:\Tuscany\SVN\trunk4\testing\itest\builder\target\surefire-reports for the individual test results.
      [ERROR] -> [Help 1]
      [ERROR] Failed to execute goal org.apache.maven.plugins:maven-surefire-plugin:2.4.3:test (default-test) on project itest-callback-two
      -composites: There are test failures.
      [ERROR]
      [ERROR] Please refer to C:\Tuscany\SVN\trunk4\testing\itest\callback-two-composites\target\surefire-reports for the individual test r
      esults.
      [ERROR] -> [Help 1]
      [ERROR] Failed to execute goal org.apache.maven.plugins:maven-surefire-plugin:2.4.3:test (default-test) on project itest-data-copy-dr
      iver: There are test failures.
      [ERROR]
      [ERROR] Please refer to C:\Tuscany\SVN\trunk4\testing\itest\data-copy\driver\target\surefire-reports for the individual test results.

      [ERROR] -> [Help 1]
      [ERROR] Failed to execute goal org.apache.maven.plugins:maven-surefire-plugin:2.4.3:test (default-test) on project itest-implementati
      on-composite: There are test failures.
      [ERROR]
      [ERROR] Please refer to C:\Tuscany\SVN\trunk4\testing\itest\implementation-composite\target\surefire-reports for the individual test
      results.
      [ERROR] -> [Help 1]
      [ERROR] Failed to execute goal org.apache.maven.plugins:maven-surefire-plugin:2.4.3:test (default-test) on project itest-jms-selector
      s: There are test failures.
      [ERROR]
      [ERROR] Please refer to C:\Tuscany\SVN\trunk4\testing\itest\jms\selectors\target\surefire-reports for the individual test results.
      [ERROR] -> [Help 1]
      [ERROR] Failed to execute goal org.apache.maven.plugins:maven-surefire-plugin:2.4.3:test (default-test) on project itest-node-launche
      r-equinox: There are test failures.
      [ERROR]
      [ERROR] Please refer to C:\Tuscany\SVN\trunk4\testing\itest\node-launcher-equinox\target\surefire-reports for the individual test res
      ults.
      [ERROR] -> [Help 1]
      [ERROR] Failed to execute goal org.apache.maven.plugins:maven-surefire-plugin:2.4.3:test (default-test) on project itest-oneway: Ther
      e are test failures.
      [ERROR]
      [ERROR] Please refer to C:\Tuscany\SVN\trunk4\testing\itest\oneway\target\surefire-reports for the individual test results.
      [ERROR] -> [Help 1]
      [ERROR] Failed to execute goal org.apache.maven.plugins:maven-surefire-plugin:2.4.3:test (default-test) on project itest-policy-match
      ing: There are test failures.
      [ERROR]
      [ERROR] Please refer to C:\Tuscany\SVN\trunk4\testing\itest\policy\matching\target\surefire-reports for the individual test results.
      [ERROR] -> [Help 1]
      [ERROR] Failed to execute goal org.apache.maven.plugins:maven-surefire-plugin:2.4.3:test (default-test) on project itest-policy-wspol
      icy: There are test failures.
      [ERROR]
      [ERROR] Please refer to C:\Tuscany\SVN\trunk4\testing\itest\policy\wspolicy\target\surefire-reports for the individual test results.
      [ERROR] -> [Help 1]
      [ERROR] Failed to execute goal org.apache.maven.plugins:maven-surefire-plugin:2.4.3:test (default-test) on project itest-policy-opera
      tions: There are test failures.
      [ERROR]
      [ERROR] Please refer to C:\Tuscany\SVN\trunk4\testing\itest\policy\operations\target\surefire-reports for the individual test results
      .
      [ERROR] -> [Help 1]
      [ERROR] Failed to execute goal org.apache.tuscany.maven.plugins:maven-osgi-junit-plugin:1.0:test (osgi-test) on project itest-scaclie
      nt-api-osgi: There are test failures.
      [ERROR]
      [ERROR] Please refer to C:\Tuscany\SVN\trunk4\testing\itest\scaclient-api-osgi\target\surefire-osgi-reports for the individual test r
      esults.
      [ERROR] -> [Help 1]
      [ERROR] Failed to execute goal org.apache.maven.plugins:maven-surefire-plugin:2.4.3:test (default-test) on project itest-scdl: There
      are test failures.
      [ERROR]
      [ERROR] Please refer to C:\Tuscany\SVN\trunk4\testing\itest\scdl\target\surefire-reports for the individual test results.
      [ERROR] -> [Help 1]
      [ERROR] Failed to execute goal org.apache.maven.plugins:maven-surefire-plugin:2.4.3:test (default-test) on project itest-service-refe
      rence: There are test failures.
      [ERROR]
      [ERROR] Please refer to C:\Tuscany\SVN\trunk4\testing\itest\service-reference\target\surefire-reports for the individual test results
      .
      [ERROR] -> [Help 1]
      [ERROR] Failed to execute goal org.apache.maven.plugins:maven-surefire-plugin:2.4.3:test (default-test) on project itest-ws-defaults:
      There are test failures.
      [ERROR]
      [ERROR] Please refer to C:\Tuscany\SVN\trunk4\testing\itest\ws\defaults\target\surefire-reports for the individual test results.
      [ERROR] -> [Help 1]
      [ERROR] Failed to execute goal org.apache.maven.plugins:maven-surefire-plugin:2.4.3:test (default-test) on project itest-ws-wsdl: The
      re are test failures.
      [ERROR]
      [ERROR] Please refer to C:\Tuscany\SVN\trunk4\testing\itest\ws\wsdl\target\surefire-reports for the individual test results.
      [ERROR] -> [Help 1]
      [ERROR] Failed to execute goal org.apache.maven.plugins:maven-surefire-plugin:2.4.3:test (default-test) on project itest-ws-endpoints
      : There are test failures.
      [ERROR]
      [ERROR] Please refer to C:\Tuscany\SVN\trunk4\testing\itest\ws\endpoints\target\surefire-reports for the individual test results.
      [ERROR] -> [Help 1]
      [ERROR] Failed to execute goal org.apache.maven.plugins:maven-surefire-plugin:2.4.3:test (default-test) on project itest-holder-ws-se
      rvice-multiple-outputs: There are test failures.
      [ERROR]
      [ERROR] Please refer to C:\Tuscany\SVN\trunk4\testing\itest\ws\holder-ws-service-multiple-outputs\target\surefire-reports for the ind
      ividual test results.
      [ERROR] -> [Help 1]
      [ERROR] Failed to execute goal org.codehaus.mojo:jaxws-maven-plugin:1.10:wsgen (wsgen1) on project itest-ws-contribution-java-first:
      Failed to execute wsgen: com.sun.mirror.apt.AnnotationProcessorFactory -> [Help 2]
      [ERROR] Failed to execute goal org.codehaus.mojo:jaxws-maven-plugin:1.10:wsgen (wsgen1) on project itest-ws-contribution-callback: Fa
      iled to execute wsgen: com/sun/tools/ws/wscompile/WsgenTool -> [Help 2]
      [ERROR] Failed to execute goal org.codehaus.mojo:jaxws-maven-plugin:1.10:wsgen (wsgen1) on project itest-ws-contribution-callback-for
      wardspec: Failed to execute wsgen: com/sun/tools/ws/wscompile/WsgenTool -> [Help 2]
      [ERROR] Failed to execute goal org.codehaus.mojo:jaxws-maven-plugin:1.10:wsgen (wsgen1) on project itest-ws-contribution-callback-ful
      lspec: Failed to execute wsgen: com/sun/tools/ws/wscompile/WsgenTool -> [Help 2]
      [ERROR] Failed to execute goal org.codehaus.mojo:jaxws-maven-plugin:1.10:wsgen (wsgen1) on project itest-ws-contribution-callback-pro
      motion: Failed to execute wsgen: com/sun/tools/ws/wscompile/WsgenTool -> [Help 2]
      [ERROR] Failed to execute goal org.codehaus.mojo:jaxws-maven-plugin:1.10:wsgen (wsgen1) on project itest-ws-contribution-doc-lit: Fai
      led to execute wsgen: com/sun/tools/ws/wscompile/WsgenTool -> [Help 2]
      [ERROR] Failed to execute goal org.codehaus.mojo:jaxws-maven-plugin:1.10:wsgen (wsgen1) on project itest-ws-contribution-doc-lit-wrap
      ped: Failed to execute wsgen: com/sun/tools/ws/wscompile/WsgenTool -> [Help 2]
      [ERROR] Failed to execute goal org.codehaus.mojo:jaxws-maven-plugin:1.10:wsgen (wsgen1) on project itest-ws-contribution-rpc-lit: Fai
      led to execute wsgen: com/sun/tools/ws/wscompile/WsgenTool -> [Help 2]
      [ERROR] Failed to execute goal org.codehaus.mojo:jaxws-maven-plugin:1.10:wsgen (wsgen1) on project itest-ws-external-service: Failed
      to execute wsgen: com/sun/tools/ws/wscompile/WsgenTool -> [Help 2]
      [ERROR] Failed to execute goal org.apache.maven.plugins:maven-surefire-plugin:2.4.3:test (default-test) on project itest-ws-launcher-
      axis2: There are test failures.
      [ERROR]
      [ERROR] Please refer to C:\Tuscany\SVN\trunk4\testing\itest\ws\launcher-axis2\target\surefire-reports for the individual test results
      .
      [ERROR] -> [Help 1]
      [ERROR] Failed to execute goal org.codehaus.mojo:jaxws-maven-plugin:1.10:wsgen (wsgen1) on project itest-ws-jaxws-contribution-java-f
      irst: Failed to execute wsgen: com/sun/tools/ws/wscompile/WsgenTool -> [Help 2]
      [ERROR] Failed to execute goal org.codehaus.mojo:jaxws-maven-plugin:1.10:wsgen (wsgen1) on project itest-ws-jaxws-external-service: F
      ailed to execute wsgen: com/sun/tools/ws/wscompile/WsgenTool -> [Help 2]
      [ERROR] Failed to execute goal org.apache.maven.plugins:maven-surefire-plugin:2.4.3:test (default-test) on project itest-ws-jaxws-lau
      ncher-ri: There are test failures.
      [ERROR]
      [ERROR] Please refer to C:\Tuscany\SVN\trunk4\testing\itest\ws-jaxws\launcher-ri\target\surefire-reports for the individual test resu
      lts.
      [ERROR] -> [Help 1]
      [ERROR] Failed to execute goal org.apache.maven.plugins:maven-surefire-plugin:2.4.3:test (default-test) on project itest-scabindingma
      pper: There are test failures.
      [ERROR]
      [ERROR] Please refer to C:\Tuscany\SVN\trunk4\testing\itest\scabindingmapper\target\surefire-reports for the individual test results.

        Activity

        ant elder created issue -

          People

          • Assignee:
            Unassigned
            Reporter:
            ant elder
          • Votes:
            0 Vote for this issue
            Watchers:
            0 Start watching this issue

            Dates

            • Created:
              Updated:

              Development