Uploaded image for project: 'Traffic Server'
  1. Traffic Server
  2. TS-1216

fail to build on 32bit system

    XMLWordPrintableJSON

    Details

    • Type: Bug
    • Status: Closed
    • Priority: Major
    • Resolution: Fixed
    • Affects Version/s: 3.1.3
    • Fix Version/s: 3.1.4
    • Component/s: Portability
    • Labels:
      None
    • Environment:

      git master, ubuntu 32bit

      Description

      looks this is a new issue for building, which is included in the httport and others:

      make[2]: Entering directory `/home/taorui/Project/trafficserver/trafficserver/proxy/stats'
      make[2]: Nothing to be done for `all'.
      make[2]: Leaving directory `/home/taorui/Project/trafficserver/trafficserver/proxy/stats'
      make[2]: Entering directory `/home/taorui/Project/trafficserver/trafficserver/proxy'
        CXX    Main.o
      Main.cc:137:52: error: initializer-string for array of chars is too long [-fpermissive]
      make[2]: *** [Main.o] Error 1
      make[2]: Leaving directory `/home/taorui/Project/trafficserver/trafficserver/proxy'
      make[1]: *** [all-recursive] Error 1
      make[1]: Leaving directory `/home/taorui/Project/trafficserver/trafficserver/proxy'
      make: *** [all-recursive] Error 1
      

        Attachments

          Activity

            People

            • Assignee:
              Unassigned
              Reporter:
              zym Zhao Yongming
            • Votes:
              0 Vote for this issue
              Watchers:
              0 Start watching this issue

              Dates

              • Created:
                Updated:
                Resolved: