Uploaded image for project: 'TinkerPop'
  1. TinkerPop
  2. TINKERPOP-2469

KrbException - Principal does not exist in test

    XMLWordPrintableJSON

    Details

    • Type: Improvement
    • Status: Closed
    • Priority: Minor
    • Resolution: Done
    • Affects Version/s: 3.4.8
    • Fix Version/s: 3.5.0, 3.4.9
    • Component/s: server
    • Labels:
      None

      Description

      Travis randomly fails Gremlin Server tests with:

      [ERROR] Tests run: 7, Failures: 0, Errors: 1, Skipped: 0, Time elapsed: 47.132 s <<< FAILURE! - in org.apache.tinkerpop.gremlin.server.GremlinServerAuditLogIntegrateTest
      [ERROR] shouldAuditLogWithSimpleAuthenticator(org.apache.tinkerpop.gremlin.server.GremlinServerAuditLogIntegrateTest)  Time elapsed: 5.598 s  <<< ERROR!
      org.apache.kerby.kerberos.kerb.KrbException: Principal does not exist.
      	at org.apache.tinkerpop.gremlin.server.GremlinServerAuditLogIntegrateTest.tearDown(GremlinServerAuditLogIntegrateTest.java:99)
      

        Attachments

          Activity

            People

            • Assignee:
              spmallette Stephen Mallette
              Reporter:
              spmallette Stephen Mallette
            • Votes:
              0 Vote for this issue
              Watchers:
              1 Start watching this issue

              Dates

              • Created:
                Updated:
                Resolved: