Uploaded image for project: 'TinkerPop'
  1. TinkerPop
  2. TINKERPOP-1360

intermittent error in spark-gremlin integration test

    XMLWordPrintableJSON

    Details

    • Type: Bug
    • Status: Closed
    • Priority: Minor
    • Resolution: Fixed
    • Affects Version/s: 3.1.3
    • Fix Version/s: 3.1.4, 3.2.2
    • Component/s: test-suite
    • Labels:
      None

      Description

      This error intermittently comes up during the Spark integration tests

      Tests run: 457, Failures: 1, Errors: 0, Skipped: 150, Time elapsed: 110.068 sec <<< FAILURE! - in org.apache.tinkerpop.gremlin.spark.process.computer.SparkGraphComputerProcessIntegrateTest
      g_V_hasXageX_propertiesXnameX(org.apache.tinkerpop.gremlin.process.traversal.step.map.PropertiesTest$Traversals)  Time elapsed: 0.185 sec  <<< FAILURE!
      java.lang.AssertionError: expected: java.lang.Integer<6> but was: java.lang.Long<6>
      	at org.junit.Assert.fail(Assert.java:88)
      	at org.junit.Assert.failNotEquals(Assert.java:834)
      	at org.junit.Assert.assertEquals(Assert.java:118)
      	at org.junit.Assert.assertEquals(Assert.java:144)
      	at org.apache.tinkerpop.gremlin.process.traversal.step.map.PropertiesTest.g_V_hasXageX_propertiesXnameX(PropertiesTest.java:103)
      	at sun.reflect.NativeMethodAccessorImpl.invoke0(Native Method)
      	at sun.reflect.NativeMethodAccessorImpl.invoke(NativeMethodAccessorImpl.java:62)
      	at sun.reflect.DelegatingMethodAccessorImpl.invoke(DelegatingMethodAccessorImpl.java:43)
      	at java.lang.reflect.Method.invoke(Method.java:497)
      	at org.junit.runners.model.FrameworkMethod$1.runReflectiveCall(FrameworkMethod.java:50)
      	at org.junit.internal.runners.model.ReflectiveCallable.run(ReflectiveCallable.java:12)
      	at org.junit.runners.model.FrameworkMethod.invokeExplosively(FrameworkMethod.java:47)
      	at org.junit.internal.runners.statements.InvokeMethod.evaluate(InvokeMethod.java:17)
      	at org.junit.internal.runners.statements.RunBefores.evaluate(RunBefores.java:26)
      	at org.junit.internal.runners.statements.RunAfters.evaluate(RunAfters.java:27)
      	at org.junit.rules.TestWatcher$1.evaluate(TestWatcher.java:55)
      	at org.junit.rules.RunRules.evaluate(RunRules.java:20)
      	at org.apache.tinkerpop.gremlin.process.GremlinProcessRunner.runChild(GremlinProcessRunner.java:53)
      	at org.apache.tinkerpop.gremlin.process.GremlinProcessRunner.runChild(GremlinProcessRunner.java:37)
      	at org.junit.runners.ParentRunner$3.run(ParentRunner.java:290)
      	at org.junit.runners.ParentRunner$1.schedule(ParentRunner.java:71)
      	at org.junit.runners.ParentRunner.runChildren(ParentRunner.java:288)
      	at org.junit.runners.ParentRunner.access$000(ParentRunner.java:58)
      	at org.junit.runners.ParentRunner$2.evaluate(ParentRunner.java:268)
      	at org.junit.runners.ParentRunner.run(ParentRunner.java:363)
      	at org.junit.runners.Suite.runChild(Suite.java:128)
      	at org.apache.tinkerpop.gremlin.AbstractGremlinSuite.runChild(AbstractGremlinSuite.java:212)
      	at org.apache.tinkerpop.gremlin.AbstractGremlinSuite.runChild(AbstractGremlinSuite.java:50)
      	at org.junit.runners.ParentRunner$3.run(ParentRunner.java:290)
      	at org.junit.runners.ParentRunner$1.schedule(ParentRunner.java:71)
      	at org.junit.runners.ParentRunner.runChildren(ParentRunner.java:288)
      	at org.junit.runners.ParentRunner.access$000(ParentRunner.java:58)
      	at org.junit.runners.ParentRunner$2.evaluate(ParentRunner.java:268)
      	at org.junit.runners.ParentRunner.run(ParentRunner.java:363)
      	at org.apache.maven.surefire.junit4.JUnit4Provider.execute(JUnit4Provider.java:264)
      	at org.apache.maven.surefire.junit4.JUnit4Provider.executeTestSet(JUnit4Provider.java:153)
      	at org.apache.maven.surefire.junit4.JUnit4Provider.invoke(JUnit4Provider.java:124)
      	at org.apache.maven.surefire.booter.ForkedBooter.invokeProviderInSameClassLoader(ForkedBooter.java:200)
      	at org.apache.maven.surefire.booter.ForkedBooter.runSuitesInProcess(ForkedBooter.java:153)
      	at org.apache.maven.surefire.booter.ForkedBooter.main(ForkedBooter.java:103)
      

      Reproduce steps:

      mvn verify -q -DskipIntegrationTests=false -pl spark-gremlin
      

      Environments used:

      Apache Maven 3.0.5
      Maven home: /usr/share/maven
      Java version: 1.8.0_91, vendor: Oracle Corporation
      Java home: /usr/lib/jvm/java-8-openjdk-amd64/jre
      Default locale: en_US, platform encoding: UTF-8
      OS name: "linux", version: "3.13.0-76-generic", arch: "amd64", family: "unix"
      -----
      Apache Maven 3.3.3 (7994120775791599e205a5524ec3e0dfe41d4a06; 2015-04-22T07:57:37-04:00)
      Maven home: /usr/lib/apache-maven-3.3.3
      Java version: 1.8.0_71, vendor: Oracle Corporation
      Java home: /Library/Java/JavaVirtualMachines/jdk1.8.0_71.jdk/Contents/Home/jre
      Default locale: en_US, platform encoding: UTF-8
      OS name: "mac os x", version: "10.11.5", arch: "x86_64", family: "mac"
      

      See also https://github.com/apache/tinkerpop/pull/335

        Attachments

          Issue Links

            Activity

              People

              • Assignee:
                pluradj Jason Plurad
                Reporter:
                pluradj Jason Plurad
              • Votes:
                0 Vote for this issue
                Watchers:
                4 Start watching this issue

                Dates

                • Created:
                  Updated:
                  Resolved: