Uploaded image for project: 'Thrift'
  1. Thrift
  2. THRIFT-5087

test/test.py fails with "AssertionError: Python 3.3 or later is required for proper operation."

    XMLWordPrintableJSON

    Details

    • Type: Bug
    • Status: Closed
    • Priority: Blocker
    • Resolution: Fixed
    • Affects Version/s: None
    • Fix Version/s: 0.14.0
    • Component/s: Build Process
    • Labels:

      Description

      /usr/bin/python test/test.py --retry-count 5 --features .* --skip-known-failures --server cpp,c_glib,cl,d,java,csharp,py,,rb,hs,perl,php,go,nodejs,dart,erl,lua,rs,netstd,nodets
      Traceback (most recent call last):
        File "test/test.py", line 45, in <module>
          assert (cur_version >= req_version), "Python 3.3 or later is required for proper operation."
      AssertionError: Python 3.3 or later is required for proper operation.
      Makefile:1129: recipe for target 'crossfeature' failed
      make: *** [crossfeature] Error 1
      

        Attachments

          Issue Links

            Activity

              People

              • Assignee:
                janosvitok Jano Svitok
                Reporter:
                jensg Jens Geyer
              • Votes:
                0 Vote for this issue
                Watchers:
                2 Start watching this issue

                Dates

                • Created:
                  Updated:
                  Resolved:

                  Time Tracking

                  Estimated:
                  Original Estimate - Not Specified
                  Not Specified
                  Remaining:
                  Remaining Estimate - 0h
                  0h
                  Logged:
                  Time Spent - 20m
                  20m