Uploaded image for project: 'Thrift'
  1. Thrift
  2. THRIFT-3358

Makefile:1362: *** missing separator. Stop.

    XMLWordPrintableJSON

    Details

    • Type: Bug
    • Status: Closed
    • Priority: Major
    • Resolution: Workaround
    • Affects Version/s: None
    • Fix Version/s: 0.11.0
    • Component/s: Build Process
    • Labels:
      None
    • Environment:

      OS X 10.10.5

      Description

      Hi

      I pulled the latest changes to 'thrift' from git.

      $ make

      ...

      /Applications/Xcode.app/Contents/Developer/usr/bin/make all-recursive
      Making all in compiler/cpp
      /Applications/Xcode.app/Contents/Developer/usr/bin/make all-am
      make[3]: Nothing to be done for `all-am'.
      Making all in lib
      Making all in cpp
      Making all in .
      make[4]: Nothing to be done for `all-am'.
      Making all in test
      Makefile:1362: *** missing separator. Stop.
      make[3]: *** [all-recursive] Error 1
      make[2]: *** [all-recursive] Error 1
      make[1]: *** [all-recursive] Error 1
      make: *** [all] Error 2

      I would look for a 'tab problem' on line 1362, however, all the makefile have less lines.

      wc Make*
      971 3539 30816 Makefile
      56 232 1441 Makefile.am
      971 3533 30442 Makefile.in
      1998 7304 62699 total

        Attachments

          Activity

            People

            • Assignee:
              jking3 James E. King III
              Reporter:
              dbl001 David Laxer
            • Votes:
              0 Vote for this issue
              Watchers:
              2 Start watching this issue

              Dates

              • Created:
                Updated:
                Resolved: