XMLWordPrintableJSON

    Details

    • Type: Bug
    • Status: To Do
    • Priority: Blocker
    • Resolution: Unresolved
    • Affects Version/s: server 3.1.0
    • Fix Version/s: None
    • Component/s: Taverna Server
    • Labels:
      None
    • Environment:
      windows

      Description

      EBUG] Verifying availability of C:\Users\sube.si\.m2\repository\org\dom4j\com.springsource.org.dom4j\1.6.1\com.springsource.org.dom4j-1.6.1.jar from [apache.snapshots (https://repository.apache.org/snapshots, default, snapshots), central (https://repo.maven.apache.org/maven2, default, releases)]
      [DEBUG] Using transporter WagonTransporter with priority -1.0 for https://repo.maven.apache.org/maven2
      [DEBUG] Using connector BasicRepositoryConnector with priority 0.0 for https://repo.maven.apache.org/maven2
      Downloading: https://repo.maven.apache.org/maven2/uk/org/mygrid/resources/biojava/1.4pre1/biojava-1.4pre1.jar
      Downloading: https://repo.maven.apache.org/maven2/org/dom4j/com.springsource.org.dom4j/1.6.1/com.springsource.org.dom4j-1.6.1.jar
      [DEBUG] Writing tracking file C:\Users\sube.si\.m2\repository\uk\org\mygrid\resources\biojava\1.4pre1\biojava-1.4pre1.jar.lastUpdated
      [DEBUG] Writing tracking file C:\Users\sube.si\.m2\repository\org\dom4j\com.springsource.org.dom4j\1.6.1\com.springsource.org.dom4j-1.6.1.jar.lastUpdated
      [INFO] ------------------------------------------------------------------------
      [INFO] BUILD FAILURE
      [INFO] ------------------------------------------------------------------------
      [INFO] Total time: 01:55 min
      [INFO] Finished at: 2020-01-24T19:16:16+05:30
      [INFO] Final Memory: 15M/51M
      [INFO] ------------------------------------------------------------------------
      [ERROR] Failed to execute goal on project taverna-localworker-activity-ui: Could not resolve dependencies for project org.apache.taverna.workbench.commonactivities:taverna-localworker-activity-ui:bundle:3.1.0-incubating-SNAPSHOT: The following artifacts could not be resolved: uk.org.mygrid.resources:biojava:jar:1.4pre1, org.dom4j:com.springsource.org.dom4j:jar:1.6.1: Could not find artifact uk.org.mygrid.resources:biojava:jar:1.4pre1 in central (https://repo.maven.apache.org/maven2) -> [Help 1]
      org.apache.maven.lifecycle.LifecycleExecutionException: Failed to execute goal on project taverna-localworker-activity-ui: Could not resolve dependencies for project org.apache.taverna.workbench.commonactivities:taverna-localworker-activity-ui:bundle:3.1.0-incubating-SNAPSHOT: The following artifacts could not be resolved: uk.org.mygrid.resources:biojava:jar:1.4pre1, org.dom4j:com.springsource.org.dom4j:jar:1.6.1: Could not find artifact uk.org.mygrid.resources:biojava:jar:1.4pre1 in central (https://repo.maven.apache.org/maven2)
      at org.apache.maven.lifecycle.internal.LifecycleDependencyResolver.getDependencies(LifecycleDependencyResolver.java:221)
      at org.apache.maven.lifecycle.internal.LifecycleDependencyResolver.resolveProjectDependencies(LifecycleDependencyResolver.java:127)
      at org.apache.maven.lifecycle.internal.MojoExecutor.ensureDependenciesAreResolved(MojoExecutor.java:245)
      at org.apache.maven.lifecycle.internal.MojoExecutor.execute(MojoExecutor.java:199)
      at org.apache.maven.lifecycle.internal.MojoExecutor.execute(MojoExecutor.java:153)
      at org.apache.maven.lifecycle.internal.MojoExecutor.execute(MojoExecutor.java:145)
      at org.apache.maven.lifecycle.internal.LifecycleModuleBuilder.buildProject(LifecycleModuleBuilder.java:116)
      at org.apache.maven.lifecycle.internal.LifecycleModuleBuilder.buildProject(LifecycleModuleBuilder.java:80)
      at org.apache.maven.lifecycle.internal.builder.singlethreaded.SingleThreadedBuilder.build(SingleThreadedBuilder.java:51)
      at org.apache.maven.lifecycle.internal.LifecycleStarter.execute(LifecycleStarter.java:128)
      at org.apache.maven.DefaultMaven.doExecute(DefaultMaven.java:307)
      at org.apache.maven.DefaultMaven.doExecute(DefaultMaven.java:193)
      at org.apache.maven.DefaultMaven.execute(DefaultMaven.java:106)
      at org.apache.maven.cli.MavenCli.execute(MavenCli.java:863)
      at org.apache.maven.cli.MavenCli.doMain(MavenCli.java:288)
      at org.apache.maven.cli.MavenCli.main(MavenCli.java:199)
      at sun.reflect.NativeMethodAccessorImpl.invoke0(Native Method)
      at sun.reflect.NativeMethodAccessorImpl.invoke(NativeMethodAccessorImpl.java:62)
      at sun.reflect.DelegatingMethodAccessorImpl.invoke(DelegatingMethodAccessorImpl.java:43)
      at java.lang.reflect.Method.invoke(Method.java:483)
      at org.codehaus.plexus.classworlds.launcher.Launcher.launchEnhanced(Launcher.java:289)
      at org.codehaus.plexus.classworlds.launcher.Launcher.launch(Launcher.java:229)
      at org.codehaus.plexus.classworlds.launcher.Launcher.mainWithExitCode(Launcher.java:415)
      at org.codehaus.plexus.classworlds.launcher.Launcher.main(Launcher.java:356)
      Caused by: org.apache.maven.project.DependencyResolutionException: Could not resolve dependencies for project org.apache.taverna.workbench.commonactivities:taverna-localworker-activity-ui:bundle:3.1.0-incubating-SNAPSHOT: The following artifacts could not be resolved: uk.org.mygrid.resources:biojava:jar:1.4pre1, org.dom4j:com.springsource.org.dom4j:jar:1.6.1: Could not find artifact uk.org.mygrid.resources:biojava:jar:1.4pre1 in central (https://repo.maven.apache.org/maven2)
      at org.apache.maven.project.DefaultProjectDependenciesResolver.resolve(DefaultProjectDependenciesResolver.java:211)
      at org.apache.maven.lifecycle.internal.LifecycleDependencyResolver.getDependencies(LifecycleDependencyResolver.java:195)
      ... 23 more
      Caused by: org.eclipse.aether.resolution.DependencyResolutionException: The following artifacts could not be resolved: uk.org.mygrid.resources:biojava:jar:1.4pre1, org.dom4j:com.springsource.org.dom4j:jar:1.6.1: Could not find artifact uk.org.mygrid.resources:biojava:jar:1.4pre1 in central (https://repo.maven.apache.org/maven2)
      at org.eclipse.aether.internal.impl.DefaultRepositorySystem.resolveDependencies(DefaultRepositorySystem.java:384)
      at org.apache.maven.project.DefaultProjectDependenciesResolver.resolve(DefaultProjectDependenciesResolver.java:205)
      ... 24 more
      Caused by: org.eclipse.aether.resolution.ArtifactResolutionException: The following artifacts could not be resolved: uk.org.mygrid.resources:biojava:jar:1.4pre1, org.dom4j:com.springsource.org.dom4j:jar:1.6.1: Could not find artifact uk.org.mygrid.resources:biojava:jar:1.4pre1 in central (https://repo.maven.apache.org/maven2)
      at org.eclipse.aether.internal.impl.DefaultArtifactResolver.resolve(DefaultArtifactResolver.java:444)
      at org.eclipse.aether.internal.impl.DefaultArtifactResolver.resolveArtifacts(DefaultArtifactResolver.java:246)
      at org.eclipse.aether.internal.impl.DefaultRepositorySystem.resolveDependencies(DefaultRepositorySystem.java:367)
      ... 25 more
      Caused by: org.eclipse.aether.transfer.ArtifactNotFoundException: Could not find artifact uk.org.mygrid.resources:biojava:jar:1.4pre1 in central (https://repo.maven.apache.org/maven2)
      at org.eclipse.aether.connector.basic.ArtifactTransportListener.transferFailed(ArtifactTransportListener.java:39)
      at org.eclipse.aether.connector.basic.BasicRepositoryConnector$TaskRunner.run(BasicRepositoryConnector.java:355)
      at org.eclipse.aether.util.concurrency.RunnableErrorForwarder$1.run(RunnableErrorForwarder.java:67)
      at java.util.concurrent.ThreadPoolExecutor.runWorker(ThreadPoolExecutor.java:1142)
      at java.util.concurrent.ThreadPoolExecutor$Worker.run(ThreadPoolExecutor.java:617)
      at java.lang.Thread.run(Thread.java:745)
      [ERROR]
      [ERROR]
      [ERROR] For more information about the errors and possible solutions, please read the following articles:
      [ERROR] [Help 1] http://cwiki.apache.org/confluence/display/MAVEN/DependencyResolutionException

        Attachments

          Activity

            People

            • Assignee:
              Unassigned
              Reporter:
              sube sube singh
            • Votes:
              0 Vote for this issue
              Watchers:
              1 Start watching this issue

              Dates

              • Created:
                Updated: