Uploaded image for project: 'Maven Surefire'
  1. Maven Surefire
  2. SUREFIRE-986

Groovy power assert incorrect indentation

    Details

    • Type: Bug
    • Status: Closed
    • Priority: Major
    • Resolution: Fixed
    • Affects Version/s: 2.14.1
    • Fix Version/s: 2.19
    • Component/s: None
    • Labels:
      None

      Description

      The groovy power assert output is misaligned since v2.13.

      2.12.4 output is correct:

      -------------------------------------------------------
       T E S T S
      -------------------------------------------------------
      Running FooIT
      Tests run: 1, Failures: 1, Errors: 0, Skipped: 0, Time elapsed: 0.317 sec <<< FAILURE!
      foo(FooIT)  Time elapsed: 0.015 sec  <<< FAILURE!
      Assertion failed: 
      
      assert "foo" == "bar"
                   |
                   false
      
      	at org.codehaus.groovy.runtime.InvokerHelper.assertFailed(InvokerHelper.java:386)
      	at org.codehaus.groovy.runtime.ScriptBytecodeAdapter.assertFailed(ScriptBytecodeAdapter.java:658)
      	at FooIT.foo(FooIT.groovy:18)
      	at sun.reflect.NativeMethodAccessorImpl.invoke0(Native Method)
      	at sun.reflect.NativeMethodAccessorImpl.invoke(NativeMethodAccessorImpl.java:57)
      	at sun.reflect.DelegatingMethodAccessorImpl.invoke(DelegatingMethodAccessorImpl.java:43)
      	at java.lang.reflect.Method.invoke(Method.java:601)
      	at org.junit.runners.model.FrameworkMethod$1.runReflectiveCall(FrameworkMethod.java:47)
      	at org.junit.internal.runners.model.ReflectiveCallable.run(ReflectiveCallable.java:12)
      	at org.junit.runners.model.FrameworkMethod.invokeExplosively(FrameworkMethod.java:44)
      	at org.junit.internal.runners.statements.InvokeMethod.evaluate(InvokeMethod.java:17)
      	at org.junit.runners.ParentRunner.runLeaf(ParentRunner.java:271)
      	at org.junit.runners.BlockJUnit4ClassRunner.runChild(BlockJUnit4ClassRunner.java:70)
      	at org.junit.runners.BlockJUnit4ClassRunner.runChild(BlockJUnit4ClassRunner.java:50)
      	at org.junit.runners.ParentRunner$3.run(ParentRunner.java:238)
      	at org.junit.runners.ParentRunner$1.schedule(ParentRunner.java:63)
      	at org.junit.runners.ParentRunner.runChildren(ParentRunner.java:236)
      	at org.junit.runners.ParentRunner.access$000(ParentRunner.java:53)
      	at org.junit.runners.ParentRunner$2.evaluate(ParentRunner.java:229)
      	at org.junit.runners.ParentRunner.run(ParentRunner.java:309)
      	at org.apache.maven.surefire.junit4.JUnit4Provider.execute(JUnit4Provider.java:252)
      	at org.apache.maven.surefire.junit4.JUnit4Provider.executeTestSet(JUnit4Provider.java:141)
      	at org.apache.maven.surefire.junit4.JUnit4Provider.invoke(JUnit4Provider.java:112)
      	at sun.reflect.NativeMethodAccessorImpl.invoke0(Native Method)
      	at sun.reflect.NativeMethodAccessorImpl.invoke(NativeMethodAccessorImpl.java:57)
      	at sun.reflect.DelegatingMethodAccessorImpl.invoke(DelegatingMethodAccessorImpl.java:43)
      	at java.lang.reflect.Method.invoke(Method.java:601)
      	at org.apache.maven.surefire.util.ReflectionUtils.invokeMethodWithArray(ReflectionUtils.java:189)
      	at org.apache.maven.surefire.booter.ProviderFactory$ProviderProxy.invoke(ProviderFactory.java:165)
      	at org.apache.maven.surefire.booter.ProviderFactory.invokeProvider(ProviderFactory.java:85)
      	at org.apache.maven.surefire.booter.ForkedBooter.runSuitesInProcess(ForkedBooter.java:115)
      	at org.apache.maven.surefire.booter.ForkedBooter.main(ForkedBooter.java:75)
      
      
      Results :
      
      Failed tests:   foo(FooIT): assert "foo" == "bar"(..)
      
      Tests run: 1, Failures: 1, Errors: 0, Skipped: 0
      

      2.14.1 output is incorrect:

      -------------------------------------------------------
       T E S T S
      -------------------------------------------------------
      Running FooIT
      Tests run: 1, Failures: 1, Errors: 0, Skipped: 0, Time elapsed: 0.274 sec <<< FAILURE!
      foo(FooIT)  Time elapsed: 0.015 sec  <<< FAILURE!
      org.codehaus.groovy.runtime.powerassert.PowerAssertionError: assert "foo" == "bar"
                   |
                   false
      	at org.codehaus.groovy.runtime.InvokerHelper.assertFailed(InvokerHelper.java:386)
      	at org.codehaus.groovy.runtime.ScriptBytecodeAdapter.assertFailed(ScriptBytecodeAdapter.java:658)
      	at FooIT.foo(FooIT.groovy:18)
      
      
      Results :
      
      Failed tests: 
        FooIT.foo:18 assert "foo" == "bar"
                   |
                   false
      
      Tests run: 1, Failures: 1, Errors: 0, Skipped: 0
      

        Attachments

          Activity

            People

            • Assignee:
              tibor17 Tibor Digana
              Reporter:
              davidkeen David Keen
            • Votes:
              1 Vote for this issue
              Watchers:
              3 Start watching this issue

              Dates

              • Created:
                Updated:
                Resolved: